{"text_format":"1","workbook":"xlsx","n_sheets":4,"sheets":["SQL Results RH","Constats par matricule","# de constats","# constat-dos-appel"],"not_rendered":{"charts":0,"images":0,"macros":1,"external_links":1,"defined_names":6,"comments":0,"pivot_tables":0},"unopened":[],"bounds":{"document_bytes":16777216,"sheet_cells":100000,"rows_first":2000,"rows_last":500,"rows_between":2000,"halvings":0,"cell_chars":16384,"cell_head_chars":4096},"cells_cut":0,"cells_raw":0,"read":"whole","date_system":"1900"}

{"sheet":"SQL Results RH","index":0,"n_rows":934,"n_cols":16,"rows_kept":934,"cut":false,"hidden":false,"merged":[]}
["MATRICULE","NOM","PRENOM","UO","Unité","DATE ENTREE","DATE DEPART","CORPS","DESCRIPTION CORPS","CLASSE","DESCRIPTION CLASSE","GRADE","DESCRIPTION GRADE","FONCTION","DESCRIPTION FONCTION","Complément d'information"]
["SQ10084","St-Amant","Daniel",6854,"Poste pr Vallée-de-l'or","2004-04-19","2005-02-06","909","OFFICIERS","05","LIEUTENANT","06","Lieutenant","090","Directeur"]
["SQ10084","St-Amant","Daniel",6854,"Poste pr Vallée-de-l'or","2005-02-07","2006-09-04","909","OFFICIERS","05","LIEUTENANT","06","Lieutenant","074","Adj Resp Poste    50"]
["SQ10084","St-Amant","Daniel",6854,"Poste pr Vallée-de-l'or","2006-09-05","2010-11-18","909","OFFICIERS","05","LIEUTENANT","06","Lieutenant","163","Adj Enquêtes      50"]
["SQ10084","St-Amant","Daniel",6854,"Poste pr Vallée-de-l'or","2010-11-19","2011-08-21","909","OFFICIERS","53","LIEUTENANT","06","Lieutenant","163","Adj Enquêtes      50"]
["SQ10084","St-Amant","Daniel",6854,"Poste pr Vallée-de-l'or","2011-08-22","2013-01-03","909","OFFICIERS","53","LIEUTENANT","06","Lieutenant","163","Adj Enquêtes      50"]
["SQ10113","Sabourin","Patrick",6854,"Poste pr Vallée-de-l'or","2006-01-06","2007-06-09","910","POLICIERS","04","AGENT CL 04","09","Agent","001","Patrouilleur"]
["SQ10113","Sabourin","Patrick",6854,"Poste pr Vallée-de-l'or","2007-06-10","2010-04-29","910","POLICIERS","04","AGENT CL 04","09","Agent","113","Superv De Relève","prêt"]
["SQ10113","Sabourin","Patrick",6854,"Poste pr Vallée-de-l'or","2010-04-30","2010-11-18","910","POLICIERS","04","AGENT CL 04","09","Agent","001","Patrouilleur"]
["SQ10113","Sabourin","Patrick",6854,"Poste pr Vallée-de-l'or","2010-11-19","2016-05-01","910","POLICIERS","12","SERGENT CL 12","07","Sergent","113","Superv De Relève"]
["SQ10113","Sabourin","Patrick",7434,"Poste pr Vallée-de-l'or","2016-05-02","2016-05-29","910","POLICIERS","12","SERGENT CL 12","07","Sergent","113","Superv De Relève"]
["SQ10113","Sabourin","Patrick",7434,"Poste pr Vallée-de-l'or","2016-05-30","2017-12-04","910","POLICIERS","12","SERGENT CL 12","07","Sergent","040","Prép. Administration"]
["SQ10113","Sabourin","Patrick",7434,"Poste pr Vallée-de-l'or","2017-12-05",null,"910","POLICIERS","22","SERGENT CL 22","07","Sergent","249","Sergent aux opérations"]
["SQ10134","Saulter","Stéphane",6854,"Poste pr Vallée-de-l'or","2011-07-04","2011-08-21","909","OFFICIERS","52","LIEUTENANT","06","Lieutenant","074","Adj Resp Poste    50"]
["SQ10134","Saulter","Stéphane",6854,"Poste pr Vallée-de-l'or","2011-08-22","2012-04-18","909","OFFICIERS","52","LIEUTENANT","06","Lieutenant","074","Adj Resp Poste    50"]
["SQ10134","Saulter","Stéphane",6854,"Poste pr Vallée-de-l'or","2012-04-19","2015-07-19","909","OFFICIERS","53","LIEUTENANT","06","Lieutenant","074","Adj Resp Poste    50"]
["SQ10134","Saulter","Stéphane",6854,"Poste pr Vallée-de-l'or","2015-07-20","2016-01-26","909","OFFICIERS","53","LIEUTENANT","06","Lieutenant","090","Directeur"]
["SQ10134","Saulter","Stéphane",6854,"Poste pr Vallée-de-l'or","2016-01-27","2016-05-01","909","OFFICIERS","43","CAPITAINE","05","Capitaine","090","Directeur"]
["SQ10134","Saulter","Stéphane",7434,"Poste pr Vallée-de-l'or","2016-05-02","2016-11-13","909","OFFICIERS","43","CAPITAINE","05","Capitaine","090","Directeur"]
["SQ10134","Saulter","Stéphane",6432,"CSMRC Val d'Or","2016-11-14","2016-11-20","909","OFFICIERS","43","CAPITAINE","05","Capitaine","090","Directeur"]
["SQ10483","Cloutier","Gaétan",6854,"Poste pr Vallée-de-l'or","2003-06-01","2006-07-06","910","POLICIERS","34","AGENT CL 34","09","Agent","003","Enquêteur Poste   50"]
["SQ10485","Cotten","Réal",6854,"Poste pr Vallée-de-l'or","2002-07-01","2006-07-13","910","POLICIERS","12","SERGENT CL 12","07","Sergent","113","Superv De Relève"]
["SQ10487","Dufour","Nathalie",6854,"Poste pr Vallée-de-l'or","2002-07-01","2006-06-30","910","POLICIERS","34","AGENT CL 34","09","Agent","003","Enquêteur Poste   50"]
["SQ10488","Falardeau","Yvon",6854,"Poste pr Vallée-de-l'or","2004-09-07","2006-08-31","910","POLICIERS","34","AGENT CL 34","09","Agent","003","Enquêteur Poste   50"]
["SQ10488","Falardeau","Yvon",6854,"Poste pr Vallée-de-l'or","2006-09-01","2010-08-17","910","POLICIERS","12","SERGENT CL 12","07","Sergent","003","Enquêteur Poste   50","changement statut"]
["SQ10488","Falardeau","Yvon",6854,"Poste pr Vallée-de-l'or","2010-08-18",null,"910","POLICIERS","12","SERGENT CL 12","07","Sergent","003","Enquêteur Poste   50"]
["SQ10489","Gagnon","Marc",6854,"Poste pr Vallée-de-l'or","2004-09-27","2006-08-31","910","POLICIERS","34","AGENT CL 34","09","Agent","003","Enquêteur Poste   50"]
["SQ10489","Gagnon","Marc",6854,"Poste pr Vallée-de-l'or","2006-09-01","2010-07-18","910","POLICIERS","12","SERGENT CL 12","07","Sergent","003","Enquêteur Poste   50"]
["SQ10489","Gagnon","Marc",6854,"Poste pr Vallée-de-l'or","2010-07-19","2010-11-18","910","POLICIERS","12","SERGENT CL 12","07","Sergent","003","Enquêteur Poste   50","situation part (150)"]
["SQ10489","Gagnon","Marc",6854,"Poste pr Vallée-de-l'or","2010-11-19","2010-12-27","910","POLICIERS","12","SERGENT CL 12","07","Sergent","003","Enquêteur Poste   50"]
["SQ10489","Gagnon","Marc",6854,"Poste pr Vallée-de-l'or","2010-12-28","2011-02-06","910","POLICIERS","12","SERGENT CL 12","07","Sergent","003","Enquêteur Poste   50","abs sagir (110)"]
["SQ10489","Gagnon","Marc",6854,"Poste pr Vallée-de-l'or","2011-02-07","2011-09-19","910","POLICIERS","12","SERGENT CL 12","07","Sergent","003","Enquêteur Poste   50"]
["SQ10491","Goulet","Louise",6854,"Poste pr Vallée-de-l'or","2002-09-15","2006-08-31","910","POLICIERS","34","AGENT CL 34","09","Agent","003","Enquêteur Poste   50"]
["SQ10491","Goulet","Louise",6854,"Poste pr Vallée-de-l'or","2006-09-01","2010-11-18","910","POLICIERS","12","SERGENT CL 12","07","Sergent","003","Enquêteur Poste   50"]
["SQ10491","Goulet","Louise",6854,"Poste pr Vallée-de-l'or","2010-11-19","2013-01-03","910","POLICIERS","12","SERGENT CL 12","07","Sergent","003","Enquêteur Poste   50"]
["SQ10491","Goulet","Louise",6854,"Poste pr Vallée-de-l'or","2013-01-04","2014-03-02","910","POLICIERS","12","SERGENT CL 12","07","Sergent","112","Resp D'Équipe","prët"]
["SQ10491","Goulet","Louise",6854,"Poste pr Vallée-de-l'or","2014-03-03","2014-06-27","910","POLICIERS","12","SERGENT CL 12","07","Sergent","003","Enquêteur Poste   50"]
["SQ10492","Durant","Robert",6854,"Poste pr Vallée-de-l'or","2002-06-27","2006-08-03","910","POLICIERS","04","AGENT CL 04","09","Agent","001","Patrouilleur","intégration"]
["SQ10492","Durant","Robert",6854,"Poste pr Vallée-de-l'or","2016-03-14","2016-05-01","909","OFFICIERS","52","LIEUTENANT","06","Lieutenant","074","Adj Resp Poste    50"]
["SQ10492","Durant","Robert",7434,"Poste pr Vallée-de-l'or","2016-05-02","2016-06-20","909","OFFICIERS","52","LIEUTENANT","06","Lieutenant","164","Resp De Poste     50"]
["SQ10492","Durant","Robert",7434,"Poste pr Vallée-de-l'or","2016-06-21","2017-02-28","909","OFFICIERS","52","LIEUTENANT","06","Lieutenant","164","Resp De Poste     50"]
["SQ10492","Durant","Robert",7434,"Poste pr Vallée-de-l'or","2017-03-01",null,"909","OFFICIERS","53","LIEUTENANT","06","Lieutenant","164","Resp De Poste     50"]
["SQ10494","Lamoureux","Claude",6854,"Poste pr Vallée-de-l'or","2004-11-08","2006-08-31","910","POLICIERS","34","AGENT CL 34","09","Agent","003","Enquêteur Poste   50"]
["SQ10494","Lamoureux","Claude",6854,"Poste pr Vallée-de-l'or","2006-09-01","2008-11-27","910","POLICIERS","12","SERGENT CL 12","07","Sergent","003","Enquêteur Poste   50","changement statut"]
["SQ10495","Langlois","Yves",6831,"Esc rég enquêtes Val-d'Or","2003-03-25","2010-03-31","910","POLICIERS","12","SERGENT CL 12","07","Sergent","004","Enquêteur"]
["SQ10495","Langlois","Yves",4175,"Éq enq région Val d'Or","2010-04-01","2012-06-13","910","POLICIERS","12","SERGENT CL 12","07","Sergent","004","Enquêteur"]
["SQ10495","Langlois","Yves",8030,"Éq enq région Val d'Or","2012-06-14","2012-10-31","910","POLICIERS","12","SERGENT CL 12","07","Sergent","004","Enquêteur"]
["SQ10495","Langlois","Yves",8113,"Éq rens crim Val d'Or","2012-11-01","2013-04-24","910","POLICIERS","12","SERGENT CL 12","07","Sergent","047","Agt. Renseignements","prêt"]
["SQ10495","Langlois","Yves",8407,"Éq enq rens criminel Val-d'Or","2013-04-25","2014-08-08","910","POLICIERS","12","SERGENT CL 12","07","Sergent","047","Agt. Renseignements","prêt"]
["SQ10495","Langlois","Yves",8425,"Éq enq région Val d'Or","2014-08-09","2016-11-13","910","POLICIERS","12","SERGENT CL 12","07","Sergent","004","Enquêteur"]
["SQ10495","Langlois","Yves",8670,"Éq enq cr maj Val d'Or","2016-11-14","2018-01-31","910","POLICIERS","12","SERGENT CL 12","07","Sergent","004","Enquêteur"]
["SQ10496","Lejeune","Mélanie",6854,"Poste pr Vallée-de-l'or","2002-06-27","2004-06-15","910","POLICIERS","04","AGENT CL 04","09","Agent","001","Patrouilleur","intégration"]
["SQ10496","Lejeune","Mélanie",6854,"Poste pr Vallée-de-l'or","2004-06-16","2004-11-01","910","POLICIERS","04","AGENT CL 04","09","Agent","001","Patrouilleur","maternité (120)"]
["SQ10496","Lejeune","Mélanie",6854,"Poste pr Vallée-de-l'or","2004-11-02","2015-10-11","910","POLICIERS","04","AGENT CL 04","09","Agent","001","Patrouilleur"]
["SQ10496","Lejeune","Mélanie",6854,"Poste pr Vallée-de-l'or","2005-10-12","2006-07-26","910","POLICIERS","04","AGENT CL 04","09","Agent","003","Enquêteur Poste   50","prêt"]
["SQ10496","Lejeune","Mélanie",6854,"Poste pr Vallée-de-l'or","2006-07-27","2006-07-27","910","POLICIERS","04","AGENT CL 04","09","Agent","001","Patrouilleur"]
["SQ10497","Letarte","Jean-Marie",6854,"Poste pr Vallée-de-l'or","2002-06-27","2005-10-27","910","POLICIERS","12","SERGENT CL 12","07","Sergent","113","Superv De Relève"]
["SQ10498","Ouellet","Sylvie",6854,"Poste pr Vallée-de-l'or","2002-06-27","2010-11-18","910","POLICIERS","04","AGENT CL 04","09","Agent","001","Patrouilleur"]
["SQ10498","Ouellet","Sylvie",6854,"Poste pr Vallée-de-l'or","2010-11-19","2011-10-23","910","POLICIERS","04","AGENT CL 04","09","Agent","001","Patrouilleur"]
["SQ10498","Ouellet","Sylvie",6854,"Poste pr Vallée-de-l'or","2011-10-24","2011-11-15","910","POLICIERS","04","AGENT CL 04","09","Agent","003","Enquêteur Poste   50","prêt"]
["SQ10498","Ouellet","Sylvie",6854,"Poste pr Vallée-de-l'or","2011-11-16","2015-06-30","910","POLICIERS","12","SERGENT CL 12","07","Sergent","003","Enquêteur Poste   50","promotion"]
["SQ10498","Ouellet","Sylvie",6854,"Poste pr Vallée-de-l'or","2015-07-01","2015-11-07","910","POLICIERS","12","SERGENT CL 12","07","Sergent","003","Enquêteur Poste   50","abs sagir (110)"]
["SQ10498","Ouellet","Sylvie",6854,"Poste pr Vallée-de-l'or","2015-11-08","2015-12-31","910","POLICIERS","12","SERGENT CL 12","07","Sergent","003","Enquêteur Poste   50","abs sagir (110)"]
["SQ10498","Ouellet","Sylvie",6854,"Poste pr Vallée-de-l'or","2016-01-01","2016-05-01","910","POLICIERS","12","SERGENT CL 12","07","Sergent","003","Enquêteur Poste   50"]
["SQ10498","Ouellet","Sylvie",7434,"Poste pr Vallée-de-l'or","2016-05-02","2016-11-13","910","POLICIERS","12","SERGENT CL 12","07","Sergent","003","Enquêteur Poste   50"]
["SQ10498","Ouellet","Sylvie",8676,"Éq enq MRC Vallée-de-l'Or","2016-11-14","2018-01-31","910","POLICIERS","12","SERGENT CL 12","07","Sergent","003","Enquêteur Poste   50"]
["SQ10499","Pelletier","Jean-Pierre",6854,"Poste pr Vallée-de-l'or","2002-06-27","2005-09-26","910","POLICIERS","12","SERGENT CL 12","07","Sergent","113","Superv De Relève"]
["SQ10499","Pelletier","Jean-Pierre",6854,"Poste pr Vallée-de-l'or","2005-09-27","2006-10-28","910","POLICIERS","12","SERGENT CL 12","07","Sergent","163","Adj Enquêtes      50","prêt"]
["SQ10499","Pelletier","Jean-Pierre",6854,"Poste pr Vallée-de-l'or","2006-10-29","2006-10-29","910","POLICIERS","12","SERGENT CL 12","07","Sergent","113","Superv De Relève"]
["SQ10499","Pelletier","Jean-Pierre",6854,"Poste pr Vallée-de-l'or","2006-10-30","2007-03-03","910","POLICIERS","12","SERGENT CL 12","07","Sergent","112","Resp D'Équipe","prêt"]
["SQ10499","Pelletier","Jean-Pierre",6854,"Poste pr Vallée-de-l'or","2007-03-04","2007-03-04","910","POLICIERS","12","SERGENT CL 12","07","Sergent","113","Superv De Relève"]
["SQ10499","Pelletier","Jean-Pierre",6854,"Poste pr Vallée-de-l'or","2007-10-11","2007-10-11","910","POLICIERS","12","SERGENT CL 12","07","Sergent","113","Superv De Relève"]
["SQ10499","Pelletier","Jean-Pierre",6854,"Poste pr Vallée-de-l'or","2007-10-12","2007-10-12","909","OFFICIERS","05","LIEUTENANT","06","Lieutenant","113","Superv De Relève"]
["SQ10499","Pelletier","Jean-Pierre",6854,"Poste pr Vallée-de-l'or","2007-11-01","2007-11-01","909","OFFICIERS","05","LIEUTENANT","06","Lieutenant","113","Superv De Relève"]
["SQ10499","Pelletier","Jean-Pierre",6854,"Poste pr Vallée-de-l'or","2008-06-02","2009-08-01","909","OFFICIERS","05","LIEUTENANT","06","Lieutenant","074","Adj Resp Poste    50"]
["SQ10499","Pelletier","Jean-Pierre",6854,"Poste pr Vallée-de-l'or","2009-08-03","2010-06-17","909","OFFICIERS","05","LIEUTENANT","06","Lieutenant","074","Adj Resp Poste    50"]
["SQ10499","Pelletier","Jean-Pierre",6854,"Poste pr Vallée-de-l'or","2010-06-18","2010-10-30","909","OFFICIERS","04","CAPITAINE","06","Lieutenant","090","Directeur"]
["SQ10499","Pelletier","Jean-Pierre",6854,"Poste pr Vallée-de-l'or","2010-10-31","2010-11-01","909","OFFICIERS","05","LIEUTENANT","06","Lieutenant","074","Adj Resp Poste    50"]
["SQ10499","Pelletier","Jean-Pierre",6854,"Poste pr Vallée-de-l'or","2010-11-02","2010-11-18","909","OFFICIERS","04","CAPITAINE","05","Capitaine","090","Directeur"]
["SQ10499","Pelletier","Jean-Pierre",6854,"Poste pr Vallée-de-l'or","2010-11-19","2011-09-13","909","OFFICIERS","43","CAPITAINE","05","Capitaine","090","Directeur"]
["SQ10499","Pelletier","Jean-Pierre",6854,"Poste pr Vallée-de-l'or","2011-09-14","2015-06-29","909","OFFICIERS","43","CAPITAINE","05","Capitaine","090","Directeur"]
["SQ10500","Picard","Claude",6854,"Poste pr Vallée-de-l'or","2002-06-27","2006-07-29","910","POLICIERS","12","SERGENT CL 12","07","Sergent","113","Superv De Relève"]
["SQ10500","Picard","Claude",6854,"Poste pr Vallée-de-l'or","2007-03-02","2007-08-23","910","POLICIERS","12","SERGENT CL 12","07","Sergent","113","Superv De Relève"]
["SQ10501","Raymond","Bernard",6854,"Poste pr Vallée-de-l'or","2002-06-27","2005-02-17","910","POLICIERS","04","AGENT CL 04","09","Agent","001","Patrouilleur"]
["SQ10501","Raymond","Bernard",6854,"Poste pr Vallée-de-l'or","2005-02-18",null,"910","POLICIERS","04","AGENT CL 04","09","Agent","001","Patrouilleur","retraite"]
["SQ10502","Ross","Lionel",6854,"Poste pr Vallée-de-l'or","2002-06-27","2009-03-01","910","POLICIERS","04","AGENT CL 04","09","Agent","001","Patrouilleur"]
["SQ10502","Ross","Lionel",6854,"Poste pr Vallée-de-l'or","2009-03-02",null,"910","POLICIERS","04","AGENT CL 04","09","Agent","001","Patrouilleur","retraite"]
["SQ10503","St-Jacques","Hubert",6854,"Poste pr Vallée-de-l'or","2002-06-27","2004-11-16","910","POLICIERS","04","AGENT CL 04","09","Agent","001","Patrouilleur","intégration"]
["SQ10503","St-Jacques","Hubert",6854,"Poste pr Vallée-de-l'or","2004-11-17","2008-06-15","910","POLICIERS","04","AGENT CL 04","09","Agent","015","Agent De Liaison  50","prêt"]
["SQ10503","St-Jacques","Hubert",6854,"Poste pr Vallée-de-l'or","2008-06-16","2008-06-16","910","POLICIERS","04","AGENT CL 04","09","Agent","001","Patrouilleur"]
["SQ10503","St-Jacques","Hubert",6854,"Poste pr Vallée-de-l'or","2008-06-17","2010-11-18","910","POLICIERS","04","AGENT CL 04","09","Agent","015","Agent De Liaison  50"]
["SQ10503","St-Jacques","Hubert",6854,"Poste pr Vallée-de-l'or","2010-11-19","2012-05-28","910","POLICIERS","04","AGENT CL 04","09","Agent","015","Agent De Liaison  50"]
["SQ10504","Sirois","Daniel",6854,"Poste pr Vallée-de-l'or","2002-06-27","2006-06-11","910","POLICIERS","04","AGENT CL 04","09","Agent","001","Patrouilleur"]
["SQ10504","Sirois","Daniel",6854,"Poste pr Vallée-de-l'or","2006-06-12","2006-08-31","910","POLICIERS","34","AGENT CL 34","09","Agent","003","Enquêteur Poste   50"]
["SQ10504","Sirois","Daniel",6854,"Poste pr Vallée-de-l'or","2006-09-01","2009-06-21","910","POLICIERS","12","SERGENT CL 12","07","Sergent","003","Enquêteur Poste   50"]
["SQ10504","Sirois","Daniel",6854,"Poste pr Vallée-de-l'or","2010-03-31","2010-03-31","910","POLICIERS","12","SERGENT CL 12","07","Sergent","003","Enquêteur Poste   50","fin d'assig. Temporaire"]
["SQ10504","Sirois","Daniel",6854,"Poste pr Vallée-de-l'or","2011-04-02","2012-02-12","910","POLICIERS","12","SERGENT CL 12","07","Sergent","003","Enquêteur Poste   50"]
["SQ10504","Sirois","Daniel",6854,"Poste pr Vallée-de-l'or","2012-02-13","2012-08-12","910","POLICIERS","12","SERGENT CL 12","07","Sergent","003","Enquêteur Poste   50"]
["SQ10504","Sirois","Daniel",6854,"Poste pr Vallée-de-l'or","2012-08-13","2016-05-01","910","POLICIERS","12","SERGENT CL 12","07","Sergent","003","Enquêteur Poste   50"]
["SQ10504","Sirois","Daniel",7434,"Poste pr Vallée-de-l'or","2016-05-02","2016-11-13","910","POLICIERS","12","SERGENT CL 12","07","Sergent","003","Enquêteur Poste   50"]
["SQ10504","Sirois","Daniel",8676,"Éq enq MRC Vallée-de-l'Or","2016-11-14","2018-01-31","910","POLICIERS","12","SERGENT CL 12","07","Sergent","003","Enquêteur Poste   50"]
["SQ10507","Chartier","Richard",6854,"Poste pr Vallée-de-l'or","2007-04-03","2007-04-03","909","OFFICIERS","05","LIEUTENANT","06","Lieutenant","074","Adj Resp Poste    50"]
["SQ10507","Chartier","Richard",6854,"Poste pr Vallée-de-l'or","2007-10-04","2009-03-09","909","OFFICIERS","05","LIEUTENANT","06","Lieutenant","074","Adj Resp Poste    50"]
["SQ10507","Chartier","Richard",6854,"Poste pr Vallée-de-l'or","2009-07-12","2009-07-12","909","OFFICIERS","05","LIEUTENANT","06","Lieutenant","074","Adj Resp Poste    50"]
["SQ10509","Baillargeon","Christian",6854,"Poste pr Vallée-de-l'or","2002-06-27","2006-09-30","910","POLICIERS","04","AGENT CL 04","09","Agent","001","Patrouilleur"]
["SQ10510","Cadrin","Réjean",6854,"Poste pr Vallée-de-l'or","2002-06-27","2003-01-31","910","POLICIERS","04","AGENT CL 04","09","Agent","001","Patrouilleur"]
["SQ10510","Cadrin","Réjean",6854,"Poste pr Vallée-de-l'or","2003-02-01","2008-06-20","910","POLICIERS","04","AGENT CL 04","09","Agent","015","Agent De Liaison  50"]
["SQ10510","Cadrin","Réjean",6854,"Poste pr Vallée-de-l'or","2008-06-21",null,"910","POLICIERS","04","AGENT CL 04","09","Agent","015","Agent De Liaison  50","retraite"]
["SQ10511","Charron","Michel",6854,"Poste pr Vallée-de-l'or","2002-06-27","2005-11-12","910","POLICIERS","12","SERGENT CL 12","07","Sergent","113","Superv De Relève"]
["SQ10511","Charron","Michel",6854,"Poste pr Vallée-de-l'or","2005-11-13",null,"910","POLICIERS","12","SERGENT CL 12","07","Sergent","113","Superv De Relève","retraite"]
["SQ10624","Côté","François",6432,"CSMRC Val d'Or","2017-08-08","2017-08-09","909","OFFICIERS","53","LIEUTENANT","06","Lieutenant","178","Off Aux Opérations"]
["SQ11135","Plante","Marc-André",6854,"Poste pr Vallée-de-l'or","1999-12-20","2000-04-30","910","POLICIERS","04","AGENT CL 04","09","Agent",401,"Patrouilleur","recrutement"]
["SQ11135","Plante","Marc-André",6854,"Poste pr Vallée-de-l'or","2002-06-27","2004-05-30","910","POLICIERS","04","AGENT CL 04","09","Agent",401,"Patrouilleur","réembauche (intégration)"]
["SQ11135","Plante","Marc-André",6854,"Poste pr Vallée-de-l'or","2004-06-01","2007-04-06","910","POLICIERS","04","AGENT CL 04","09","Agent","001","Patrouilleur"]
["SQ11135","Plante","Marc-André",6854,"Poste pr Vallée-de-l'or","2011-08-19","2012-09-16","910","POLICIERS","12","SERGENT CL 12","07","Sergent","113","Superv De Relève"]
["SQ11135","Plante","Marc-André",7434,"Poste pr Vallée-de-l'or","2016-07-05","2016-08-03","910","POLICIERS","04","AGENT CL 04","09","Agent","501","Patrouilleur"]
["SQ11135","Plante","Marc-André",7434,"Poste pr Vallée-de-l'or","2016-08-04","2016-12-07","910","POLICIERS","12","SERGENT CL 12","07","Sergent","113","Superv De Relève"]
["SQ11135","Plante","Marc-André",7434,"Poste pr Vallée-de-l'or","2016-12-08","2017-03-18","910","POLICIERS","12","SERGENT CL 12","07","Sergent","040","Prép. Administration","prêt"]
["SQ11135","Plante","Marc-André",7434,"Poste pr Vallée-de-l'or","2017-03-19",null,"910","POLICIERS","12","SERGENT CL 12","07","Sergent","113","Superv De Relève"]
["SQ11174","Richer","Mathieu",6854,"Poste pr Vallée-de-l'or","2004-01-12","2005-02-17","910","POLICIERS","04","AGENT CL 04","09","Agent","001","Patrouilleur"]
["SQ11199","Beauchamp","Lyne",6854,"Poste pr Vallée-de-l'or","2004-01-12","2005-05-23","910","POLICIERS","04","AGENT CL 04","09","Agent","001","Patrouilleur"]
["SQ11199","Beauchamp","Lyne",6854,"Poste pr Vallée-de-l'or","2005-05-24","2005-07-23","910","POLICIERS","04","AGENT CL 04","09","Agent","015","Agent De Liaison  50","prêt"]
["SQ11199","Beauchamp","Lyne",6854,"Poste pr Vallée-de-l'or","2005-07-24","2006-10-29","910","POLICIERS","04","AGENT CL 04","09","Agent","001","Patrouilleur"]
["SQ11199","Beauchamp","Lyne",6854,"Poste pr Vallée-de-l'or","2006-10-30","2007-03-30","910","POLICIERS","04","AGENT CL 04","09","Agent","003","Enquêteur Poste   50","prêt"]
["SQ11199","Beauchamp","Lyne",6854,"Poste pr Vallée-de-l'or","2007-03-31","2007-06-09","910","POLICIERS","04","AGENT CL 04","09","Agent","001","Patrouilleur"]
["SQ11199","Beauchamp","Lyne",6854,"Poste pr Vallée-de-l'or","2007-06-10","2007-10-03","910","POLICIERS","04","AGENT CL 04","09","Agent","113","Superv De Relève","prêt"]
["SQ11199","Beauchamp","Lyne",6854,"Poste pr Vallée-de-l'or","2007-10-04","2007-10-04","910","POLICIERS","04","AGENT CL 04","09","Agent","001","Patrouilleur"]
["SQ11241","Scodeller","Tonino",6854,"Poste pr Vallée-de-l'or","2004-03-01","2006-07-27","910","POLICIERS","04","AGENT CL 04","09","Agent","001","Patrouilleur"]
["SQ11255","Tremblay","Jonathan",6854,"Poste pr Vallée-de-l'or","2004-03-01","2007-01-18","910","POLICIERS","04","AGENT CL 04","09","Agent","001","Patrouilleur"]
["SQ11273","April","Marc",6854,"Poste pr Vallée-de-l'or","2004-01-12","2006-10-29","910","POLICIERS","04","AGENT CL 04","09","Agent","001","Patrouilleur"]
["SQ11273","April","Marc",6854,"Poste pr Vallée-de-l'or","2006-10-30","2007-03-30","910","POLICIERS","04","AGENT CL 04","09","Agent","003","Enquêteur Poste   50","prêt"]
["SQ11273","April","Marc",6854,"Poste pr Vallée-de-l'or","2007-03-31","2008-01-05","910","POLICIERS","04","AGENT CL 04","09","Agent","001","Patrouilleur"]
["SQ11273","April","Marc",6854,"Poste pr Vallée-de-l'or","2008-03-27","2008-03-27","910","POLICIERS","04","AGENT CL 04","09","Agent","001","Patrouilleur"]
["SQ11273","April","Marc",8425,"Éq enq région Val d'Or","2013-03-01","2014-06-28","910","POLICIERS","12","SERGENT CL 12","07","Sergent","004","Enquêteur","prêt"]
["SQ11273","April","Marc",8425,"Éq enq région Val d'Or","2014-06-29","2014-07-12","910","POLICIERS","12","SERGENT CL 12","07","Sergent","004","Enquêteur","prêt"]
["SQ11273","April","Marc",8425,"Éq enq région Val d'Or","2014-07-13","2016-11-13","910","POLICIERS","12","SERGENT CL 12","07","Sergent","004","Enquêteur","prêt"]
["SQ11279","St-Louis","Guillaume",6854,"Poste pr Vallée-de-l'or","2004-01-12","2007-01-15","910","POLICIERS","04","AGENT CL 04","09","Agent","001","Patrouilleur"]
["SQ11279","St-Louis","Guillaume",6854,"Poste pr Vallée-de-l'or","2007-01-16","2007-03-23","910","POLICIERS","04","AGENT CL 04","09","Agent","003","Enquêteur Poste   50","prêt"]
["SQ11279","St-Louis","Guillaume",6854,"Poste pr Vallée-de-l'or","2007-03-24","2007-10-11","910","POLICIERS","04","AGENT CL 04","09","Agent","001","Patrouilleur"]
["SQ11281","Dion","Claude",6854,"Poste pr Vallée-de-l'or","2004-08-01","2007-12-13","910","POLICIERS","04","AGENT CL 04","09","Agent","001","Patrouilleur"]
["SQ11305","Rankin","Terry",6854,"Poste pr Vallée-de-l'or","2004-03-01","2007-07-07","910","POLICIERS","04","AGENT CL 04","09","Agent","001","Patrouilleur"]
["SQ11305","Rankin","Terry",6854,"Poste pr Vallée-de-l'or","2007-07-08","2007-08-01","910","POLICIERS","04","AGENT CL 04","09","Agent","001","Patrouilleur","congé sans solde paternité (121)"]
["SQ11305","Rankin","Terry",6854,"Poste pr Vallée-de-l'or","2007-08-02","2007-08-02","910","POLICIERS","04","AGENT CL 04","09","Agent","001","Patrouilleur"]
["SQ11346","Moran","Suzie",6854,"Poste pr Vallée-de-l'or","2004-08-01","2007-02-04","910","POLICIERS","04","AGENT CL 04","09","Agent","001","Patrouilleur"]
["SQ11346","Moran","Suzie",6854,"Poste pr Vallée-de-l'or","2007-02-05","2007-06-30","910","POLICIERS","04","AGENT CL 04","09","Agent","001","Patrouilleur","congé maternité (120)"]
["SQ11346","Moran","Suzie",6854,"Poste pr Vallée-de-l'or","2007-07-01","2007-07-01","910","POLICIERS","04","AGENT CL 04","09","Agent","001","Patrouilleur"]
["SQ11346","Moran","Suzie",6854,"Poste pr Vallée-de-l'or","2007-07-02","2007-12-14","910","POLICIERS","04","AGENT CL 04","09","Agent","001","Patrouilleur","sans solde sabatique (123)"]
["SQ11346","Moran","Suzie",6854,"Poste pr Vallée-de-l'or","2007-12-15","2007-12-15","910","POLICIERS","04","AGENT CL 04","09","Agent","001","Patrouilleur"]
["SQ11346","Moran","Suzie",6854,"Poste pr Vallée-de-l'or","2007-12-16","2008-08-21","910","POLICIERS","04","AGENT CL 04","09","Agent","001","Patrouilleur"]
["SQ11421","Lévesque","Christian",6854,"Poste pr Vallée-de-l'or","2004-06-20","2007-03-04","910","POLICIERS","04","AGENT CL 04","09","Agent","001","Patrouilleur"]
["SQ11421","Lévesque","Christian",6854,"Poste pr Vallée-de-l'or","2007-03-05","2007-03-30","910","POLICIERS","04","AGENT CL 04","09","Agent","015","Agent De Liaison  50","prêt"]
["SQ11421","Lévesque","Christian",6854,"Poste pr Vallée-de-l'or","2007-03-31","2007-10-03","910","POLICIERS","04","AGENT CL 04","09","Agent","001","Patrouilleur"]
["SQ11421","Lévesque","Christian",6854,"Poste pr Vallée-de-l'or","2007-10-04","2007-11-30","910","POLICIERS","12","SERGENT CL 12","09","Agent","113","Superv De Relève","prêt"]
["SQ11421","Lévesque","Christian",6854,"Poste pr Vallée-de-l'or","2007-12-01","2008-05-22","910","POLICIERS","04","AGENT CL 04","09","Agent","001","Patrouilleur"]
["SQ11433","Bouvier","Julie",7434,"Poste pr Vallée-de-l'or","2016-11-08","2016-12-20","910","POLICIERS","12","SERGENT CL 12","07","Sergent","034","Agent Rel Communaut"]
["SQ11433","Bouvier","Julie",8209,"Éq liaison autoch Val d'Or","2016-12-21","2017-11-14","910","POLICIERS","12","SERGENT CL 12","07","Sergent","032","Agt Liais. Autoch 02","prêt"]
["SQ11433","Bouvier","Julie",8209,"Éq liaison autoch Val d'Or","2017-11-15","","910","POLICIERS","12","SERGENT CL 12","07","Sergent","032","Agt Liais. Autoch 02","prêt"]
["SQ11448","Aubé","Kerry",6854,"Poste pr Vallée-de-l'or","2004-09-01","2007-10-04","910","POLICIERS","04","AGENT CL 04","09","Agent","001","Patrouilleur"]
["SQ11448","Aubé","Kerry",6854,"Poste pr Vallée-de-l'or","2007-10-05","2007-11-07","910","POLICIERS","04","AGENT CL 04","09","Agent","113","Superv De Relève","prêt"]
["SQ11448","Aubé","Kerry",6854,"Poste pr Vallée-de-l'or","2007-11-08","2008-10-02","910","POLICIERS","04","AGENT CL 04","09","Agent","001","Patrouilleur"]
["SQ11551","Boutin","Marie-Andrée",6854,"Poste pr Vallée-de-l'or","2005-05-01","2009-06-13","910","POLICIERS","04","AGENT CL 04","09","Agent","001","Patrouilleur"]
["SQ11551","Boutin","Marie-Andrée",6854,"Poste pr Vallée-de-l'or","2009-06-14","2010-01-20","910","POLICIERS","04","AGENT CL 04","09","Agent","003","Enquêteur Poste   50","prêt"]
["SQ11551","Boutin","Marie-Andrée",6854,"Poste pr Vallée-de-l'or","2010-01-21","2010-01-31","910","POLICIERS","04","AGENT CL 04","09","Agent","001","Patrouilleur"]
["SQ11552","Pigeon","Mathieu",6854,"Poste pr Vallée-de-l'or","2005-05-01","2007-08-11","910","POLICIERS","04","AGENT CL 04","09","Agent","001","Patrouilleur"]
["SQ11552","Pigeon","Mathieu",6854,"Poste pr Vallée-de-l'or","2007-08-12","2007-08-31","910","POLICIERS","12","SERGENT CL 12","07","Sergent","001","Patrouilleur"]
["SQ11574","Brousseau","Joëlle",6854,"Poste pr Vallée-de-l'or","2005-10-01","2009-01-31","910","POLICIERS","04","AGENT CL 04","09","Agent","001","Patrouilleur"]
["SQ11588","Richard","Pascal",6854,"Poste pr Vallée-de-l'or","2009-03-27","2010-10-04","910","POLICIERS","04","AGENT CL 04","09","Agent","001","Patrouilleur"]
["SQ11588","Richard","Pascal",6854,"Poste pr Vallée-de-l'or","2010-10-05","2010-11-18","910","POLICIERS","04","AGENT CL 04","09","Agent","003","Enquêteur Poste   50","prêt"]
["SQ11588","Richard","Pascal",6854,"Poste pr Vallée-de-l'or","2010-11-19","2010-12-21","910","POLICIERS","04","AGENT CL 04","09","Agent","003","Enquêteur Poste   50","prêt"]
["SQ11588","Richard","Pascal",6854,"Poste pr Vallée-de-l'or","2010-12-22","2011-03-11","910","POLICIERS","04","AGENT CL 04","09","Agent","001","Patrouilleur"]
["SQ11588","Richard","Pascal",6854,"Poste pr Vallée-de-l'or","2011-03-12","2011-10-15","910","POLICIERS","04","AGENT CL 04","09","Agent","113","Superv De Relève","prêt"]
["SQ11588","Richard","Pascal",6854,"Poste pr Vallée-de-l'or","2011-10-16","2012-03-04","910","POLICIERS","04","AGENT CL 04","09","Agent","001","Patrouilleur"]
["SQ11588","Richard","Pascal",6854,"Poste pr Vallée-de-l'or","2012-03-05","2012-07-22","910","POLICIERS","04","AGENT CL 04","09","Agent","177","Patrouille Urbaine"]
["SQ11588","Richard","Pascal",6854,"Poste pr Vallée-de-l'or","2012-07-23","2012-08-03","910","POLICIERS","04","AGENT CL 04","09","Agent","015","Agent De Liaison  50","prêt"]
["SQ11588","Richard","Pascal",6854,"Poste pr Vallée-de-l'or","2012-08-04","2016-05-01","910","POLICIERS","04","AGENT CL 04","09","Agent","177","Patrouille Urbaine"]
["SQ11588","Richard","Pascal",7434,"Poste pr Vallée-de-l'or","2016-05-02","2017-08-27","910","POLICIERS","04","AGENT CL 04","09","Agent","177","Patrouille Urbaine"]
["SQ11588","Richard","Pascal",7434,"Poste pr Vallée-de-l'or","2017-08-28","2017-11-09","910","POLICIERS","12","SERGENT CL 12","07","Sergent","203","P.I.M.S.","prêt"]
["SQ11588","Richard","Pascal",7434,"Poste pr Vallée-de-l'or","2017-11-10","2018-01-31","910","POLICIERS","12","SERGENT CL 12","07","Sergent","177","Patrouille Urbaine"]
["SQ11589","Boulanger","Geoffroy",6854,"Poste pr Vallée-de-l'or","2003-02-04","2005-01-31","910","POLICIERS","06","AGENT AUXILIAIRE","09","Agent","401","Patrouilleur Aux  50"]
["SQ11589","Boulanger","Geoffroy",6854,"Poste pr Vallée-de-l'or","2005-02-01","2005-09-30","910","POLICIERS","04","AGENT CL 04","09","Agent","001","Patrouilleur"]
["SQ11595","Cousineau","Simon",6854,"Poste pr Vallée-de-l'or","2003-02-04","2005-01-31","910","POLICIERS","06","AGENT AUXILIAIRE","09","Agent","401","Patrouilleur Aux  50"]
["SQ11595","Cousineau","Simon",6854,"Poste pr Vallée-de-l'or","2005-02-01","2006-01-31","910","POLICIERS","04","AGENT CL 04","09","Agent","001","Patrouilleur"]
["SQ11607","Millette","Lysanne",6854,"Poste pr Vallée-de-l'or","2003-03-11","2005-02-28","910","POLICIERS","06","AGENT AUXILIAIRE","09","Agent","401","Patrouilleur Aux  50"]
["SQ11607","Millette","Lysanne",6854,"Poste pr Vallée-de-l'or","2005-03-01","2005-09-30","910","POLICIERS","04","AGENT CL 04","09","Agent","001","Patrouilleur"]
["SQ11607","Millette","Lysanne",6854,"Poste pr Vallée-de-l'or","2008-05-01","2010-11-18","910","POLICIERS","04","AGENT CL 04","09","Agent","177","Patrouille Urbaine"]
["SQ11607","Millette","Lysanne",6854,"Poste pr Vallée-de-l'or","2010-11-19","2010-12-24","910","POLICIERS","04","AGENT CL 04","09","Agent","177","Patrouille Urbaine"]
["SQ11607","Millette","Lysanne",6854,"Poste pr Vallée-de-l'or","2010-12-25","2011-05-03","910","POLICIERS","04","AGENT CL 04","09","Agent","177","Patrouille Urbaine"]
["SQ11607","Millette","Lysanne",6854,"Poste pr Vallée-de-l'or","2011-05-04","2012-06-04","910","POLICIERS","04","AGENT CL 04","09","Agent","177","Patrouille Urbaine"]
["SQ11620","Pierre","James",6854,"Poste pr Vallée-de-l'or","2003-04-29","2005-03-31","910","POLICIERS","06","AGENT AUXILIAIRE","09","Agent","401","Patrouilleur Aux  50"]
["SQ11620","Pierre","James",6854,"Poste pr Vallée-de-l'or","2005-04-01","2005-12-31","910","POLICIERS","04","AGENT CL 04","09","Agent","001","Patrouilleur"]
["SQ11636","Descôteaux","Claudie",6854,"Poste pr Vallée-de-l'or","2003-09-16","2005-08-31","910","POLICIERS","06","AGENT AUXILIAIRE","09","Agent","401","Patrouilleur Aux  50"]
["SQ11636","Descôteaux","Claudie",6854,"Poste pr Vallée-de-l'or","2005-09-01","2006-01-31","910","POLICIERS","04","AGENT CL 04","09","Agent","001","Patrouilleur"]
["SQ11641","Toupin","Isabelle",6854,"Poste pr Vallée-de-l'or","2003-09-16","2005-08-31","910","POLICIERS","06","AGENT AUXILIAIRE","09","Agent","401","Patrouilleur Aux  50"]
["SQ11641","Toupin","Isabelle",6854,"Poste pr Vallée-de-l'or","2005-09-01","2005-09-30","910","POLICIERS","04","AGENT CL 04","09","Agent","001","Patrouilleur"]
["SQ11657","Brunet","Mylène",6854,"Poste pr Vallée-de-l'or","2004-03-01","2005-02-08","910","POLICIERS","04","AGENT CL 04","09","Agent","001","Patrouilleur"]
["SQ11657","Brunet","Mylène",6854,"Poste pr Vallée-de-l'or","2005-02-09","2005-06-04","910","POLICIERS","04","AGENT CL 04","09","Agent","003","Enquêteur Poste   50","prêt"]
["SQ11657","Brunet","Mylène",6854,"Poste pr Vallée-de-l'or","2005-06-05","2006-07-06","910","POLICIERS","04","AGENT CL 04","09","Agent","001","Patrouilleur"]
["SQ11657","Brunet","Mylène",6854,"Poste pr Vallée-de-l'or","2006-07-07","2006-08-31","910","POLICIERS","34","AGENT CL 34","09","Agent","003","Enquêteur Poste   50","ok"]
["SQ11657","Brunet","Mylène",6854,"Poste pr Vallée-de-l'or","2006-09-01","2008-08-31","910","POLICIERS","12","SERGENT CL 12","07","Sergent","003","Enquêteur Poste   50"]
["SQ11657","Brunet","Mylène",8425,"Éq enq région Val d'Or","2013-03-01","2014-06-30","910","POLICIERS","12","SERGENT CL 12","07","Sergent","004","Enquêteur"]
["SQ11657","Brunet","Mylène",8425,"Éq enq région Val d'Or","2014-07-01","2014-12-31","910","POLICIERS","12","SERGENT CL 12","07","Sergent","004","Enquêteur","abs sagir (110)"]
["SQ11657","Brunet","Mylène",8425,"Éq enq région Val d'Or","2015-01-01","2016-11-13","910","POLICIERS","12","SERGENT CL 12","07","Sergent","004","Enquêteur"]
["SQ11722","Moreau","Raymond",6854,"Poste pr Vallée-de-l'or","2006-05-01","2009-07-11","910","POLICIERS","04","AGENT CL 04","09","Agent","001","Patrouilleur"]
["SQ11722","Moreau","Raymond",6854,"Poste pr Vallée-de-l'or","2009-07-12","2009-08-14","910","POLICIERS","04","AGENT CL 04","09","Agent","001","Patrouilleur","congé sans solde paternité (121)"]
["SQ11722","Moreau","Raymond",6854,"Poste pr Vallée-de-l'or","2009-08-15","2010-11-18","910","POLICIERS","04","AGENT CL 04","09","Agent","001","Patrouilleur"]
["SQ11722","Moreau","Raymond",6854,"Poste pr Vallée-de-l'or","2010-11-19","2010-12-09","910","POLICIERS","04","AGENT CL 04","09","Agent","001","Patrouilleur"]
["SQ11756","Bélanger","Marie-Eve",6854,"Poste pr Vallée-de-l'or","2006-06-01","2007-09-22","910","POLICIERS","04","AGENT CL 04","09","Agent","001","Patrouilleur"]
["SQ11756","Bélanger","Marie-Eve",6854,"Poste pr Vallée-de-l'or","2007-09-23","2008-02-15","910","POLICIERS","04","AGENT CL 04","09","Agent","001","Patrouilleur","maternité (120)"]
["SQ11756","Bélanger","Marie-Eve",6854,"Poste pr Vallée-de-l'or","2008-02-16","2008-02-16","910","POLICIERS","04","AGENT CL 04","09","Agent","001","Patrouilleur"]
["SQ11756","Bélanger","Marie-Eve",6854,"Poste pr Vallée-de-l'or","2008-02-17","2008-09-13","910","POLICIERS","04","AGENT CL 04","09","Agent","001","Patrouilleur","sans solde sabatique (123)"]
["SQ11756","Bélanger","Marie-Eve",6854,"Poste pr Vallée-de-l'or","2008-09-14","2008-11-29","910","POLICIERS","04","AGENT CL 04","09","Agent","001","Patrouilleur"]
["SQ11756","Bélanger","Marie-Eve",6854,"Poste pr Vallée-de-l'or","2008-11-30","2009-04-24","910","POLICIERS","04","AGENT CL 04","09","Agent","001","Patrouilleur","maternité (120)"]
["SQ11756","Bélanger","Marie-Eve",6854,"Poste pr Vallée-de-l'or","2009-04-25","2009-04-25","910","POLICIERS","04","AGENT CL 04","09","Agent","001","Patrouilleur"]
["SQ11756","Bélanger","Marie-Eve",6854,"Poste pr Vallée-de-l'or","2009-04-26","2009-11-13","910","POLICIERS","04","AGENT CL 04","09","Agent","001","Patrouilleur","sans solde sabatique (123)"]
["SQ11756","Bélanger","Marie-Eve",6854,"Poste pr Vallée-de-l'or","2009-11-14","2010-09-26","910","POLICIERS","04","AGENT CL 04","09","Agent","001","Patrouilleur"]
["SQ11788","Guertin","Michel",6854,"Poste pr Vallée-de-l'or","2006-06-01","2007-09-30","910","POLICIERS","04","AGENT CL 04","09","Agent","001","Patrouilleur"]
["SQ11791","Claveau","Régis",6854,"Poste pr Vallée-de-l'or","2006-06-01","2007-12-15","910","POLICIERS","04","AGENT CL 04","09","Agent","001","Patrouilleur"]
["SQ11791","Claveau","Régis",6854,"Poste pr Vallée-de-l'or","2007-12-16","2008-01-18","910","POLICIERS","04","AGENT CL 04","09","Agent","001","Patrouilleur","congé sans solde paternité (121)"]
["SQ11791","Claveau","Régis",6854,"Poste pr Vallée-de-l'or","2008-01-19","2008-12-06","910","POLICIERS","04","AGENT CL 04","09","Agent","001","Patrouilleur"]
["SQ11791","Claveau","Régis",6854,"Poste pr Vallée-de-l'or","2008-12-07","2009-01-09","910","POLICIERS","04","AGENT CL 04","09","Agent","001","Patrouilleur","congé sans solde paternité (121)"]
["SQ11791","Claveau","Régis",6854,"Poste pr Vallée-de-l'or","2009-01-10","2009-08-29","910","POLICIERS","04","AGENT CL 04","09","Agent","001","Patrouilleur"]
["SQ11791","Claveau","Régis",6854,"Poste pr Vallée-de-l'or","2009-08-30","2009-11-13","910","POLICIERS","04","AGENT CL 04","09","Agent","001","Patrouilleur","congé sans solde paternité (121)"]
["SQ11791","Claveau","Régis",6854,"Poste pr Vallée-de-l'or","2009-11-14","2010-11-18","910","POLICIERS","04","AGENT CL 04","09","Agent","001","Patrouilleur"]
["SQ11791","Claveau","Régis",6854,"Poste pr Vallée-de-l'or","2010-11-19","2010-11-25","910","POLICIERS","04","AGENT CL 04","09","Agent","001","Patrouilleur"]
["SQ11827","Landry","André-Benoit",6854,"Poste pr Vallée-de-l'or","2006-08-01","2008-04-30","910","POLICIERS","04","AGENT CL 04","09","Agent","001","Patrouilleur"]
["SQ11827","Landry","André-Benoit",6854,"Poste pr Vallée-de-l'or","2008-05-01","2008-12-13","910","POLICIERS","04","AGENT CL 04","09","Agent","177","Patrouille Urbaine"]
["SQ11827","Landry","André-Benoit",6854,"Poste pr Vallée-de-l'or","2008-12-14","2009-01-16","910","POLICIERS","04","AGENT CL 04","09","Agent","177","Patrouille Urbaine","congé sans solde paternité (121)"]
["SQ11827","Landry","André-Benoit",6854,"Poste pr Vallée-de-l'or","2009-01-17","2010-11-18","910","POLICIERS","04","AGENT CL 04","09","Agent","177","Patrouille Urbaine"]
["SQ11827","Landry","André-Benoit",6854,"Poste pr Vallée-de-l'or","2010-11-19","2010-12-25","910","POLICIERS","04","AGENT CL 04","09","Agent","177","Patrouille Urbaine"]
["SQ11827","Landry","André-Benoit",6854,"Poste pr Vallée-de-l'or","2010-12-26","2011-01-08","910","POLICIERS","04","AGENT CL 04","09","Agent","177","Patrouille Urbaine","abs sagir (110)"]
["SQ11827","Landry","André-Benoit",6854,"Poste pr Vallée-de-l'or","2011-01-09","2012-02-29","910","POLICIERS","04","AGENT CL 04","09","Agent","177","Patrouille Urbaine"]
["SQ11827","Landry","André-Benoit",6854,"Poste pr Vallée-de-l'or","2012-03-01","2016-05-01","910","POLICIERS","04","AGENT CL 04","09","Agent","015","Agent De Liaison  50"]
["SQ11827","Landry","André-Benoit",7434,"Poste pr Vallée-de-l'or","2016-05-02",null,"910","POLICIERS","04","AGENT CL 04","09","Agent","015","Agent De Liaison  50"]
["SQ11848","Rivest","Philippe",6854,"Poste pr Vallée-de-l'or","2006-08-01","2008-07-19","910","POLICIERS","04","AGENT CL 04","09","Agent","001","Patrouilleur"]
["SQ11848","Rivest","Philippe",6854,"Poste pr Vallée-de-l'or","2008-07-20","2008-08-22","910","POLICIERS","04","AGENT CL 04","09","Agent","001","Patrouilleur","congé sans solde paternité (121)"]
["SQ11848","Rivest","Philippe",6854,"Poste pr Vallée-de-l'or","2008-08-23","2009-12-17","910","POLICIERS","04","AGENT CL 04","09","Agent","001","Patrouilleur"]
["SQ11904","Lareau","François",6854,"Poste pr Vallée-de-l'or","2004-06-08","2006-05-31","910","POLICIERS","06","AGENT AUXILIAIRE","09","Agent","401","Patrouilleur Aux  50"]
["SQ11904","Lareau","François",6854,"Poste pr Vallée-de-l'or","2006-06-01","2006-09-30","910","POLICIERS","04","AGENT CL 04","09","Agent","001","Patrouilleur"]
["SQ11904","Lareau","François",6854,"Poste pr Vallée-de-l'or","2009-02-06","2010-11-18","910","POLICIERS","12","SERGENT CL 12","07","Sergent","003","Enquêteur Poste   50"]
["SQ11904","Lareau","François",6854,"Poste pr Vallée-de-l'or","2010-11-19","2016-05-01","910","POLICIERS","12","SERGENT CL 12","07","Sergent","003","Enquêteur Poste   50"]
["SQ11904","Lareau","François",7434,"Poste pr Vallée-de-l'or","2016-05-02","2016-10-30","910","POLICIERS","12","SERGENT CL 12","07","Sergent","003","Enquêteur Poste   50"]
["SQ11904","Lareau","François",8425,"Éq enq région Val d'Or","2016-10-31","2016-11-13","910","POLICIERS","12","SERGENT CL 12","07","Sergent","004","Enquêteur","prêt"]
["SQ11904","Lareau","François",8670,"Éq enq cr maj Val d'Or","2016-11-14",null,"910","POLICIERS","12","SERGENT CL 12","07","Sergent","004","Enquêteur","prêt"]
["SQ11943","Audet","Philippe",6854,"Poste pr Vallée-de-l'or","2004-09-13","2006-07-12","910","POLICIERS","06","AGENT AUXILIAIRE","09","Agent","401","Patrouilleur Aux  50"]
["SQ11943","Audet","Philippe",6854,"Poste pr Vallée-de-l'or","2006-07-13","2007-01-30","910","POLICIERS","07","AGENT SUR HOR. VAR.","09","Agent","400","Agt Sur Hor. Var."]
["SQ11943","Audet","Philippe",6854,"Poste pr Vallée-de-l'or","2007-01-31","2008-07-12","910","POLICIERS","04","AGENT CL 04","09","Agent","001","Patrouilleur"]
["SQ11943","Audet","Philippe",6854,"Poste pr Vallée-de-l'or","2008-07-13","2008-08-15","910","POLICIERS","04","AGENT CL 04","09","Agent","001","Patrouilleur","congé sans solde paternité (121)"]
["SQ11943","Audet","Philippe",6854,"Poste pr Vallée-de-l'or","2008-08-16","2009-07-25","910","POLICIERS","04","AGENT CL 04","09","Agent","001","Patrouilleur"]
["SQ11943","Audet","Philippe",6854,"Poste pr Vallée-de-l'or","2009-07-26","2009-08-28","910","POLICIERS","04","AGENT CL 04","09","Agent","001","Patrouilleur","congé sans solde paternité (121)"]
["SQ11943","Audet","Philippe",6854,"Poste pr Vallée-de-l'or","2009-08-29","2010-11-18","910","POLICIERS","04","AGENT CL 04","09","Agent","001","Patrouilleur"]
["SQ11943","Audet","Philippe",6854,"Poste pr Vallée-de-l'or","2010-11-19","2012-03-25","910","POLICIERS","04","AGENT CL 04","09","Agent","001","Patrouilleur"]
["SQ11943","Audet","Philippe",6854,"Poste pr Vallée-de-l'or","2012-03-26","2012-06-03","910","POLICIERS","04","AGENT CL 04","09","Agent","113","Superv De Relève","prêt"]
["SQ11943","Audet","Philippe",6854,"Poste pr Vallée-de-l'or","2012-06-04","2015-11-03","910","POLICIERS","04","AGENT CL 04","09","Agent","001","Patrouilleur"]
["SQ11943","Audet","Philippe",6854,"Poste pr Vallée-de-l'or","2015-11-04","2016-05-01","910","POLICIERS","04","AGENT CL 04","09","Agent","001","Patrouilleur","assig. Admin. (130)"]
["SQ11943","Audet","Philippe",7434,"Poste pr Vallée-de-l'or","2016-05-02","2016-05-03","910","POLICIERS","04","AGENT CL 04","09","Agent","001","Patrouilleur"]
["SQ11943","Audet","Philippe",7434,"Poste pr Vallée-de-l'or","2016-05-04","2016-11-17","910","POLICIERS","04","AGENT CL 04","09","Agent","001","Patrouilleur","assig. Admin. (130)"]
["SQ11943","Audet","Philippe",7434,"Poste pr Vallée-de-l'or","2016-11-18",null,"910","POLICIERS","04","AGENT CL 04","09","Agent","001","Patrouilleur"]
["SQ11944","Shaffer","Dominique",6854,"Poste pr Vallée-de-l'or","2004-09-13","2006-07-12","910","POLICIERS","06","AGENT AUXILIAIRE","09","Agent","401","Patrouilleur Aux  50"]
["SQ11944","Shaffer","Dominique",6854,"Poste pr Vallée-de-l'or","2006-07-13","2007-05-18","910","POLICIERS","07","AGENT SUR HOR. VAR.","09","Agent","400","Agt Sur Hor. Var."]
["SQ11944","Shaffer","Dominique",6854,"Poste pr Vallée-de-l'or","2007-05-19","2008-03-29","910","POLICIERS","04","AGENT CL 04","09","Agent","001","Patrouilleur"]
["SQ11944","Shaffer","Dominique",6854,"Poste pr Vallée-de-l'or","2008-03-30","2008-08-22","910","POLICIERS","04","AGENT CL 04","09","Agent","001","Patrouilleur","maternité (120)"]
["SQ11944","Shaffer","Dominique",6854,"Poste pr Vallée-de-l'or","2008-08-23","2008-08-23","910","POLICIERS","04","AGENT CL 04","09","Agent","001","Patrouilleur"]
["SQ11944","Shaffer","Dominique",6854,"Poste pr Vallée-de-l'or","2008-08-24","2009-02-27","910","POLICIERS","04","AGENT CL 04","09","Agent","001","Patrouilleur","sans solde sabatique (123)"]
["SQ11944","Shaffer","Dominique",6854,"Poste pr Vallée-de-l'or","2009-02-28","2010-06-05","910","POLICIERS","04","AGENT CL 04","09","Agent","001","Patrouilleur"]
["SQ11944","Shaffer","Dominique",6854,"Poste pr Vallée-de-l'or","2010-06-06","2010-10-29","910","POLICIERS","04","AGENT CL 04","09","Agent","001","Patrouilleur","maternité (120)"]
["SQ11944","Shaffer","Dominique",6854,"Poste pr Vallée-de-l'or","2010-10-30","2010-10-30","910","POLICIERS","04","AGENT CL 04","09","Agent","001","Patrouilleur"]
["SQ11944","Shaffer","Dominique",6854,"Poste pr Vallée-de-l'or","2010-10-31","2010-11-18","910","POLICIERS","04","AGENT CL 04","09","Agent","001","Patrouilleur","sans solde sabatique (123)"]
["SQ11944","Shaffer","Dominique",6854,"Poste pr Vallée-de-l'or","2010-11-19","2011-05-14","910","POLICIERS","04","AGENT CL 04","09","Agent","001","Patrouilleur","abs sagir (110)"]
["SQ11944","Shaffer","Dominique",6854,"Poste pr Vallée-de-l'or","2011-05-15","2015-09-16","910","POLICIERS","04","AGENT CL 04","09","Agent","001","Patrouilleur"]
["SQ11944","Shaffer","Dominique",6854,"Poste pr Vallée-de-l'or","2015-09-17","2015-11-16","910","POLICIERS","04","AGENT CL 04","09","Agent","001","Patrouilleur"]
["SQ11944","Shaffer","Dominique",6854,"Poste pr Vallée-de-l'or","2015-11-17","2016-05-01","910","POLICIERS","12","SERGENT CL 12","07","Sergent","003","Enquêteur Poste   50"]
["SQ11944","Shaffer","Dominique",7434,"Poste pr Vallée-de-l'or","2016-05-02","2016-11-13","910","POLICIERS","12","SERGENT CL 12","07","Sergent","003","Enquêteur Poste   50"]
["SQ11944","Shaffer","Dominique",8676,"Éq enq MRC Vallée-de-l'Or","2016-11-14","2018-01-31","910","POLICIERS","12","SERGENT CL 12","07","Sergent","003","Enquêteur Poste   50"]
["SQ11972","Benoit","David",6854,"Poste pr Vallée-de-l'or","2007-10-01","2008-07-19","910","POLICIERS","04","AGENT CL 04","09","Agent","001","Patrouilleur"]
["SQ11972","Benoit","David",6854,"Poste pr Vallée-de-l'or","2008-07-20","2008-08-08","910","POLICIERS","04","AGENT CL 04","09","Agent","001","Patrouilleur","congé sans solde paternité (121)"]
["SQ11972","Benoit","David",6854,"Poste pr Vallée-de-l'or","2008-08-09","2010-11-18","910","POLICIERS","04","AGENT CL 04","09","Agent","001","Patrouilleur"]
["SQ11972","Benoit","David",6854,"Poste pr Vallée-de-l'or","2010-11-19","2011-02-26","910","POLICIERS","04","AGENT CL 04","09","Agent","001","Patrouilleur"]
["SQ11972","Benoit","David",6854,"Poste pr Vallée-de-l'or","2011-02-27","2011-03-12","910","POLICIERS","04","AGENT CL 04","09","Agent","001","Patrouilleur","abs sagir (110)"]
["SQ11972","Benoit","David",6854,"Poste pr Vallée-de-l'or","2011-03-13","2011-12-31","910","POLICIERS","04","AGENT CL 04","09","Agent","001","Patrouilleur"]
["SQ11972","Benoit","David",6854,"Poste pr Vallée-de-l'or","2012-01-01","2012-01-21","910","POLICIERS","04","AGENT CL 04","09","Agent","001","Patrouilleur","abs sagir (110)"]
["SQ11972","Benoit","David",6854,"Poste pr Vallée-de-l'or","2012-01-22","2016-05-01","910","POLICIERS","04","AGENT CL 04","09","Agent","001","Patrouilleur"]
["SQ11972","Benoit","David",7434,"Poste pr Vallée-de-l'or","2016-05-02","2018-04-23","910","POLICIERS","04","AGENT CL 04","09","Agent","001","Patrouilleur"]
["SQ11976","Lachance","Louis Maxime",6854,"Poste pr Vallée-de-l'or","2007-09-01","2008-08-16","910","POLICIERS","04","AGENT CL 04","09","Agent","001","Patrouilleur"]
["SQ11976","Lachance","Louis Maxime",6854,"Poste pr Vallée-de-l'or","2008-08-17","2008-08-29","910","POLICIERS","04","AGENT CL 04","09","Agent","001","Patrouilleur","congé sans solde paternité (121)"]
["SQ11976","Lachance","Louis Maxime",6854,"Poste pr Vallée-de-l'or","2008-08-30","2008-12-20","910","POLICIERS","04","AGENT CL 04","09","Agent","001","Patrouilleur"]
["SQ11976","Lachance","Louis Maxime",6854,"Poste pr Vallée-de-l'or","2008-12-21","2009-01-09","910","POLICIERS","04","AGENT CL 04","09","Agent","001","Patrouilleur","congé sans solde paternité (121)"]
["SQ11976","Lachance","Louis Maxime",6854,"Poste pr Vallée-de-l'or","2009-01-10","2010-11-18","910","POLICIERS","04","AGENT CL 04","09","Agent","001","Patrouilleur"]
["SQ11976","Lachance","Louis Maxime",6854,"Poste pr Vallée-de-l'or","2010-11-19","2012-05-05","910","POLICIERS","04","AGENT CL 04","09","Agent","001","Patrouilleur"]
["SQ11976","Lachance","Louis Maxime",6854,"Poste pr Vallée-de-l'or","2012-05-06","2012-05-19","910","POLICIERS","04","AGENT CL 04","09","Agent","001","Patrouilleur","abs sagir (110)"]
["SQ11976","Lachance","Louis Maxime",6854,"Poste pr Vallée-de-l'or","2012-05-20","2012-05-26","910","POLICIERS","04","AGENT CL 04","09","Agent","001","Patrouilleur"]
["SQ11976","Lachance","Louis Maxime",6854,"Poste pr Vallée-de-l'or","2012-05-27","2012-06-11","910","POLICIERS","04","AGENT CL 04","09","Agent","001","Patrouilleur","abs sagir (110)"]
["SQ12003","Allaire-Champagne","Yan",6854,"Poste pr Vallée-de-l'or","2011-01-28","2011-08-27","910","POLICIERS","04","AGENT CL 04","09","Agent","001","Patrouilleur"]
["SQ12003","Allaire-Champagne","Yan",6854,"Poste pr Vallée-de-l'or","2011-08-28","2011-10-01","910","POLICIERS","04","AGENT CL 04","09","Agent","001","Patrouilleur","abs sagir (110)"]
["SQ12003","Allaire-Champagne","Yan",6854,"Poste pr Vallée-de-l'or","2011-10-02","2012-06-18","910","POLICIERS","04","AGENT CL 04","09","Agent","001","Patrouilleur"]
["SQ12089","Jacques","Michaël",6854,"Poste pr Vallée-de-l'or","2008-04-01","2010-11-18","910","POLICIERS","04","AGENT CL 04","09","Agent","001","Patrouilleur"]
["SQ12089","Jacques","Michaël",6854,"Poste pr Vallée-de-l'or","2010-11-19","2012-06-30","910","POLICIERS","04","AGENT CL 04","09","Agent","001","Patrouilleur"]
["SQ12092","Gaudet","Cynthia",6854,"Poste pr Vallée-de-l'or","2005-05-09","2006-07-12","910","POLICIERS","06","AGENT AUXILIAIRE","09","Agent","401","Patrouilleur Aux  50"]
["SQ12092","Gaudet","Cynthia",6854,"Poste pr Vallée-de-l'or","2006-07-13","2007-10-05","910","POLICIERS","07","AGENT SUR HOR. VAR.","09","Agent","400","Agt Sur Hor. Var."]
["SQ12092","Gaudet","Cynthia",6854,"Poste pr Vallée-de-l'or","2007-10-06","2007-10-31","910","POLICIERS","04","AGENT CL 04","09","Agent","001","Patrouilleur"]
["SQ12130","Loranger","Marie-Claude",6854,"Poste pr Vallée-de-l'or","2005-05-30","2007-05-31","910","POLICIERS","06","AGENT AUXILIAIRE","09","Agent","401","Patrouilleur Aux  50"]
["SQ12138","Dionne","Dominic",6854,"Poste pr Vallée-de-l'or","2005-05-30","2006-07-12","910","POLICIERS","06","AGENT AUXILIAIRE","09","Agent","401","Patrouilleur Aux  50"]
["SQ12138","Dionne","Dominic",6854,"Poste pr Vallée-de-l'or","2006-07-13","2007-11-05","910","POLICIERS","07","AGENT SUR HOR. VAR.","09","Agent","400","Agt Sur Hor. Var."]
["SQ12138","Dionne","Dominic",6854,"Poste pr Vallée-de-l'or","2007-11-06","2007-11-30","910","POLICIERS","04","AGENT CL 04","09","Agent","001","Patrouilleur"]
["SQ12148","Désabrais","Nancy",6854,"Poste pr Vallée-de-l'or","2005-09-12","2006-07-12","910","POLICIERS","06","AGENT AUXILIAIRE","09","Agent","401","Patrouilleur Aux  50"]
["SQ12148","Désabrais","Nancy",6854,"Poste pr Vallée-de-l'or","2006-07-13","2008-01-07","910","POLICIERS","07","AGENT SUR HOR. VAR.","09","Agent","400","Agt Sur Hor. Var."]
["SQ12148","Désabrais","Nancy",6854,"Poste pr Vallée-de-l'or","2008-01-08","2008-04-11","910","POLICIERS","07","AGENT SUR HOR. VAR.","09","Agent","400","Agt Sur Hor. Var."]
["SQ12148","Désabrais","Nancy",6854,"Poste pr Vallée-de-l'or","2008-04-12","2010-11-18","910","POLICIERS","04","AGENT CL 04","09","Agent","001","Patrouilleur"]
["SQ12148","Désabrais","Nancy",6854,"Poste pr Vallée-de-l'or","2010-11-19","2014-03-15","910","POLICIERS","04","AGENT CL 04","09","Agent","001","Patrouilleur"]
["SQ12148","Désabrais","Nancy",6854,"Poste pr Vallée-de-l'or","2014-03-16","2014-08-09","910","POLICIERS","04","AGENT CL 04","09","Agent","001","Patrouilleur","maternité (120)"]
["SQ12148","Désabrais","Nancy",6854,"Poste pr Vallée-de-l'or","2014-08-10","2015-02-28","910","POLICIERS","04","AGENT CL 04","09","Agent","001","Patrouilleur","abs sagir (110)"]
["SQ12148","Désabrais","Nancy",6854,"Poste pr Vallée-de-l'or","2015-03-01","2016-01-02","910","POLICIERS","04","AGENT CL 04","09","Agent","001","Patrouilleur"]
["SQ12148","Désabrais","Nancy",6854,"Poste pr Vallée-de-l'or","2016-01-03","2016-05-01","910","POLICIERS","04","AGENT CL 04","09","Agent","001","Patrouilleur","maternité (120)"]
["SQ12148","Désabrais","Nancy",7434,"Poste pr Vallée-de-l'or","2016-05-02","2016-05-28","910","POLICIERS","04","AGENT CL 04","09","Agent","001","Patrouilleur","maternité (120)"]
["SQ12148","Désabrais","Nancy",7434,"Poste pr Vallée-de-l'or","2016-05-29","2016-12-17","910","POLICIERS","04","AGENT CL 04","09","Agent","001","Patrouilleur","abs sagir (110)"]
["SQ12148","Désabrais","Nancy",7434,"Poste pr Vallée-de-l'or","2016-12-18",null,"910","POLICIERS","04","AGENT CL 04","09","Agent","001","Patrouilleur"]
["SQ12224","Godbout","Jonathan",6854,"Poste pr Vallée-de-l'or","2005-11-28","2006-07-12","910","POLICIERS","06","AGENT AUXILIAIRE","09","Agent","401","Patrouilleur Aux  50"]
["SQ12224","Godbout","Jonathan",6854,"Poste pr Vallée-de-l'or","2006-07-13","2008-06-28","910","POLICIERS","07","AGENT SUR HOR. VAR.","09","Agent","400","Agt Sur Hor. Var."]
["SQ12224","Godbout","Jonathan",6854,"Poste pr Vallée-de-l'or","2008-06-29","2008-08-01","910","POLICIERS","07","AGENT SUR HOR. VAR.","09","Agent","400","Agt Sur Hor. Var.","congé sans solde paternité (121)"]
["SQ12224","Godbout","Jonathan",6854,"Poste pr Vallée-de-l'or","2008-08-02","2008-08-04","910","POLICIERS","07","AGENT SUR HOR. VAR.","09","Agent","400","Agt Sur Hor. Var."]
["SQ12224","Godbout","Jonathan",6854,"Poste pr Vallée-de-l'or","2008-08-05","2009-12-16","910","POLICIERS","04","AGENT CL 04","09","Agent","001","Patrouilleur"]
["SQ12224","Godbout","Jonathan",6854,"Poste pr Vallée-de-l'or","2009-12-17","2010-01-15","910","POLICIERS","04","AGENT CL 04","09","Agent","001","Patrouilleur","congé sans solde paternité (121)"]
["SQ12224","Godbout","Jonathan",6854,"Poste pr Vallée-de-l'or","2010-01-16","2010-07-24","910","POLICIERS","04","AGENT CL 04","09","Agent","001","Patrouilleur"]
["SQ12224","Godbout","Jonathan",6854,"Poste pr Vallée-de-l'or","2010-07-25","2010-08-07","910","POLICIERS","04","AGENT CL 04","09","Agent","001","Patrouilleur","congé sans solde paternité (121)"]
["SQ12224","Godbout","Jonathan",6854,"Poste pr Vallée-de-l'or","2010-08-08","2010-11-18","910","POLICIERS","04","AGENT CL 04","09","Agent","001","Patrouilleur"]
["SQ12224","Godbout","Jonathan",6854,"Poste pr Vallée-de-l'or","2010-11-19","2012-06-18","910","POLICIERS","04","AGENT CL 04","09","Agent","001","Patrouilleur"]
["SQ12236","Carbonneau","François",6854,"Poste pr Vallée-de-l'or","2008-12-01","2010-11-18","910","POLICIERS","04","AGENT CL 04","09","Agent","001","Patrouilleur"]
["SQ12236","Carbonneau","François",6854,"Poste pr Vallée-de-l'or","2010-11-19","2011-04-02","910","POLICIERS","04","AGENT CL 04","09","Agent","001","Patrouilleur"]
["SQ12236","Carbonneau","François",6854,"Poste pr Vallée-de-l'or","2011-04-03","2011-04-23","910","POLICIERS","04","AGENT CL 04","09","Agent","001","Patrouilleur","abs sagir (110)"]
["SQ12236","Carbonneau","François",6854,"Poste pr Vallée-de-l'or","2011-04-24","2013-09-23","910","POLICIERS","04","AGENT CL 04","09","Agent","001","Patrouilleur"]
["SQ12236","Carbonneau","François",6854,"Poste pr Vallée-de-l'or","2013-09-24","2014-11-29","910","POLICIERS","12","SERGENT CL 12","07","Sergent","113","Superv De Relève","promotion"]
["SQ12236","Carbonneau","François",6854,"Poste pr Vallée-de-l'or","2014-11-30","2014-12-19","910","POLICIERS","12","SERGENT CL 12","07","Sergent","113","Superv De Relève"]
["SQ12236","Carbonneau","François",6854,"Poste pr Vallée-de-l'or","2014-12-20","2015-01-10","910","POLICIERS","12","SERGENT CL 12","07","Sergent","113","Superv De Relève"]
["SQ12236","Carbonneau","François",6854,"Poste pr Vallée-de-l'or","2015-01-11","2015-01-23","910","POLICIERS","12","SERGENT CL 12","07","Sergent","113","Superv De Relève"]
["SQ12236","Carbonneau","François",6854,"Poste pr Vallée-de-l'or","2015-01-24","2015-06-20","910","POLICIERS","12","SERGENT CL 12","07","Sergent","113","Superv De Relève"]
["SQ12236","Carbonneau","François",6854,"Poste pr Vallée-de-l'or","2015-06-21","2015-08-29","910","POLICIERS","12","SERGENT CL 12","07","Sergent","113","Superv De Relève"]
["SQ12236","Carbonneau","François",6854,"Poste pr Vallée-de-l'or","2015-08-30","2016-05-01","910","POLICIERS","12","SERGENT CL 12","07","Sergent","113","Superv De Relève"]
["SQ12236","Carbonneau","François",7434,"Poste pr Vallée-de-l'or","2016-05-02",null,"910","POLICIERS","12","SERGENT CL 12","07","Sergent","113","Superv De Relève"]
["SQ12297","Marcoux","Jean-Philippe",6854,"Poste pr Vallée-de-l'or","2009-03-13","2010-02-28","910","POLICIERS","04","AGENT CL 04","09","Agent","001","Patrouilleur"]
["SQ12307","Castonguay","Pierre-Luc",6854,"Poste pr Vallée-de-l'or","2006-04-03","2006-07-12","910","POLICIERS","06","AGENT AUXILIAIRE","09","Agent","401","Patrouilleur Aux  50"]
["SQ12307","Castonguay","Pierre-Luc",6854,"Poste pr Vallée-de-l'or","2006-07-13","2009-06-28","910","POLICIERS","07","AGENT SUR HOR. VAR.","09","Agent","400","Agt Sur Hor. Var."]
["SQ12307","Castonguay","Pierre-Luc",6854,"Poste pr Vallée-de-l'or","2009-06-29","2009-07-28","910","POLICIERS","07","AGENT SUR HOR. VAR.","09","Agent","003","Enquêteur Poste   50","prêt"]
["SQ12307","Castonguay","Pierre-Luc",6854,"Poste pr Vallée-de-l'or","2009-07-29","2009-07-29","910","POLICIERS","07","AGENT SUR HOR. VAR.","09","Agent","400","Agt Sur Hor. Var."]
["SQ12307","Castonguay","Pierre-Luc",6854,"Poste pr Vallée-de-l'or","2009-07-30","2009-07-30","910","POLICIERS","04","AGENT CL 04","09","Agent","001","Patrouilleur"]
["SQ12307","Castonguay","Pierre-Luc",6854,"Poste pr Vallée-de-l'or","2009-07-31","2010-06-04","910","POLICIERS","04","AGENT CL 04","09","Agent","003","Enquêteur Poste   50","prêt"]
["SQ12307","Castonguay","Pierre-Luc",6854,"Poste pr Vallée-de-l'or","2010-06-05","2010-06-05","910","POLICIERS","04","AGENT CL 04","09","Agent","001","Patrouilleur"]
["SQ12307","Castonguay","Pierre-Luc",6854,"Poste pr Vallée-de-l'or","2010-06-06","2010-06-26","910","POLICIERS","04","AGENT CL 04","09","Agent","001","Patrouilleur","congé sans solde paternité (121)"]
["SQ12307","Castonguay","Pierre-Luc",6854,"Poste pr Vallée-de-l'or","2010-06-27","2010-06-27","910","POLICIERS","04","AGENT CL 04","09","Agent","001","Patrouilleur"]
["SQ12307","Castonguay","Pierre-Luc",6854,"Poste pr Vallée-de-l'or","2010-06-28","2010-11-18","910","POLICIERS","04","AGENT CL 04","09","Agent","003","Enquêteur Poste   50","prêt"]
["SQ12307","Castonguay","Pierre-Luc",6854,"Poste pr Vallée-de-l'or","2010-11-19","2010-12-18","910","POLICIERS","12","SERGENT CL 12","07","Sergent","003","Enquêteur Poste   50"]
["SQ12307","Castonguay","Pierre-Luc",6854,"Poste pr Vallée-de-l'or","2010-12-19","2011-01-01","910","POLICIERS","04","AGENT CL 04","09","Agent","003","Enquêteur Poste   50","abs sagir (110)"]
["SQ12307","Castonguay","Pierre-Luc",6854,"Poste pr Vallée-de-l'or","2011-01-02","2011-03-11","910","POLICIERS","04","AGENT CL 04","09","Agent","003","Enquêteur Poste   50"]
["SQ12307","Castonguay","Pierre-Luc",6854,"Poste pr Vallée-de-l'or","2011-03-12","2014-06-10","910","POLICIERS","12","SERGENT CL 12","07","Sergent","003","Enquêteur Poste   50"]
["SQ12307","Castonguay","Pierre-Luc",6854,"Poste pr Vallée-de-l'or","2014-06-11","2014-06-28","910","POLICIERS","12","SERGENT CL 12","07","Sergent","003","Enquêteur Poste   50","congé spécial (103)"]
["SQ12307","Castonguay","Pierre-Luc",6854,"Poste pr Vallée-de-l'or","2014-06-29","2014-07-12","910","POLICIERS","12","SERGENT CL 12","07","Sergent","003","Enquêteur Poste   50"]
["SQ12307","Castonguay","Pierre-Luc",6854,"Poste pr Vallée-de-l'or","2014-07-13","2014-08-09","910","POLICIERS","12","SERGENT CL 12","07","Sergent","003","Enquêteur Poste   50","abs sagir (110)"]
["SQ12307","Castonguay","Pierre-Luc",6854,"Poste pr Vallée-de-l'or","2014-08-10","2016-05-01","910","POLICIERS","12","SERGENT CL 12","07","Sergent","003","Enquêteur Poste   50"]
["SQ12307","Castonguay","Pierre-Luc",7434,"Poste pr Vallée-de-l'or","2016-05-02","2016-11-13","910","POLICIERS","12","SERGENT CL 12","07","Sergent","003","Enquêteur Poste   50"]
["SQ12307","Castonguay","Pierre-Luc",8676,"Éq enq MRC Vallée-de-l'Or","2016-11-14","2017-03-28","910","POLICIERS","12","SERGENT CL 12","07","Sergent","003","Enquêteur Poste   50","MSO"]
["SQ12307","Castonguay","Pierre-Luc",8676,"Éq enq MRC Vallée-de-l'Or","2017-03-29",null,"910","POLICIERS","12","SERGENT CL 12","07","Sergent","003","Enquêteur Poste   50","assig. Admin. (130)"]
["SQ12335","Petit","Alexandre",6854,"Poste pr Vallée-de-l'or","2006-05-01","2006-07-12","910","POLICIERS","06","AGENT AUXILIAIRE","09","Agent","401","Patrouilleur Aux  50"]
["SQ12335","Petit","Alexandre",6854,"Poste pr Vallée-de-l'or","2006-07-13","2007-06-07","910","POLICIERS","07","AGENT SUR HOR. VAR.","09","Agent","400","Agt Sur Hor. Var."]
["SQ12335","Petit","Alexandre",6854,"Poste pr Vallée-de-l'or","2007-06-08",null,"910","POLICIERS","07","AGENT SUR HOR. VAR.","09","Agent","400","Agt Sur Hor. Var.","congédiement"]
["SQ12387","Thibodeau","Pierre-Luc",6854,"Poste pr Vallée-de-l'or","2006-09-25","2009-09-25","910","POLICIERS","07","AGENT SUR HOR. VAR.","09","Agent","400","Agt Sur Hor. Var."]
["SQ12387","Thibodeau","Pierre-Luc",6854,"Poste pr Vallée-de-l'or","2009-09-26","2009-11-30","910","POLICIERS","04","AGENT CL 04","09","Agent","001","Patrouilleur"]
["SQ12387","Thibodeau","Pierre-Luc",6854,"Poste pr Vallée-de-l'or","2012-06-26","2016-05-01","910","POLICIERS","04","AGENT CL 04","09","Agent","001","Patrouilleur"]
["SQ12387","Thibodeau","Pierre-Luc",7434,"Poste pr Vallée-de-l'or","2016-05-02","2017-07-08","910","POLICIERS","04","AGENT CL 04","09","Agent","001","Patrouilleur"]
["SQ12387","Thibodeau","Pierre-Luc",7434,"Poste pr Vallée-de-l'or","2017-07-09","2017-08-12","910","POLICIERS","04","AGENT CL 04","09","Agent","001","Patrouilleur"]
["SQ12387","Thibodeau","Pierre-Luc",7434,"Poste pr Vallée-de-l'or","2017-08-13","2017-08-19","910","POLICIERS","04","AGENT CL 04","09","Agent","001","Patrouilleur"]
["SQ12387","Thibodeau","Pierre-Luc",7434,"Poste pr Vallée-de-l'or","2017-08-20","2017-09-02","910","POLICIERS","04","AGENT CL 04","09","Agent","001","Patrouilleur","abs sagir (110)"]
["SQ12387","Thibodeau","Pierre-Luc",7434,"Poste pr Vallée-de-l'or","2017-09-03","2018-03-12","910","POLICIERS","04","AGENT CL 04","09","Agent","001","Patrouilleur"]
["SQ12391","Lafrance","Kevin",6854,"Poste pr Vallée-de-l'or","2006-09-25","2009-09-25","910","POLICIERS","07","AGENT SUR HOR. VAR.","09","Agent","400","Agt Sur Hor. Var."]
["SQ12391","Lafrance","Kevin",6854,"Poste pr Vallée-de-l'or","2009-09-26","2010-11-18","910","POLICIERS","04","AGENT CL 04","09","Agent","001","Patrouilleur"]
["SQ12391","Lafrance","Kevin",6854,"Poste pr Vallée-de-l'or","2010-11-19","2014-07-12","910","POLICIERS","04","AGENT CL 04","09","Agent","001","Patrouilleur"]
["SQ12391","Lafrance","Kevin",6854,"Poste pr Vallée-de-l'or","2014-07-13","2014-07-26","910","POLICIERS","04","AGENT CL 04","09","Agent","001","Patrouilleur","congé spécial (103)"]
["SQ12391","Lafrance","Kevin",6854,"Poste pr Vallée-de-l'or","2014-07-27","2015-10-29","910","POLICIERS","04","AGENT CL 04","09","Agent","001","Patrouilleur"]
["SQ12391","Lafrance","Kevin",6854,"Poste pr Vallée-de-l'or","2015-10-30","2016-05-01","910","POLICIERS","12","SERGENT CL 12","07","Sergent","203","P.I.M.S.","prêt"]
["SQ12391","Lafrance","Kevin",7434,"Poste pr Vallée-de-l'or","2016-05-02","2016-06-18","910","POLICIERS","12","SERGENT CL 12","07","Sergent","203","P.I.M.S.","prêt"]
["SQ12391","Lafrance","Kevin",7434,"Poste pr Vallée-de-l'or","2016-06-19","2016-09-05","910","POLICIERS","04","AGENT CL 04","09","Agent","001","Patrouilleur"]
["SQ12391","Lafrance","Kevin",7434,"Poste pr Vallée-de-l'or","2016-09-06","2016-10-15","910","POLICIERS","12","SERGENT CL 12","07","Sergent","203","P.I.M.S.","prêt"]
["SQ12391","Lafrance","Kevin",7434,"Poste pr Vallée-de-l'or","2016-10-16","2016-11-05","910","POLICIERS","12","SERGENT CL 12","07","Sergent","203","P.I.M.S.","congé spécial (103)"]
["SQ12391","Lafrance","Kevin",7434,"Poste pr Vallée-de-l'or","2016-11-06","2017-03-09","910","POLICIERS","12","SERGENT CL 12","07","Sergent","203","P.I.M.S.","prêt"]
["SQ12391","Lafrance","Kevin",7434,"Poste pr Vallée-de-l'or","2017-03-10","2017-07-22","910","POLICIERS","12","SERGENT CL 12","07","Sergent","113","Superv De Relève"]
["SQ12391","Lafrance","Kevin",7434,"Poste pr Vallée-de-l'or","2017-07-23","2017-08-05","910","POLICIERS","12","SERGENT CL 12","07","Sergent","113","Superv De Relève","congé spécial (103)"]
["SQ12391","Lafrance","Kevin",7434,"Poste pr Vallée-de-l'or","2017-08-06","2018-05-21","910","POLICIERS","12","SERGENT CL 12","07","Sergent","113","Superv De Relève"]
["SQ12419","Frenette","Annabelle",6854,"Poste pr Vallée-de-l'or","2012-06-26","2012-11-15","910","POLICIERS","24","AGENT CL 24","09","Agent","001","Patrouilleur"]
["SQ12419","Frenette","Annabelle",6854,"Poste pr Vallée-de-l'or","2012-11-16","2012-11-16","910","POLICIERS","24","AGENT CL 24","09","Agent","001","Patrouilleur"]
["SQ12419","Frenette","Annabelle",6854,"Poste pr Vallée-de-l'or","2012-11-17","2012-11-17","910","POLICIERS","24","AGENT CL 24","09","Agent","177","Patrouille Urbaine"]
["SQ12419","Frenette","Annabelle",6854,"Poste pr Vallée-de-l'or","2012-11-18","2016-05-01","910","POLICIERS","24","AGENT CL 24","09","Agent","177","Patrouille Urbaine"]
["SQ12419","Frenette","Annabelle",7434,"Poste pr Vallée-de-l'or","2016-05-02","2017-11-18","910","POLICIERS","24","AGENT CL 24","09","Agent","177","Patrouille Urbaine"]
["SQ12419","Frenette","Annabelle",8676,"Éq enq MRC Vallée-de-l'Or","2017-11-19","2018-01-31","910","POLICIERS","24","AGENT CL 24","09","Agent","003","Enquêteur Poste   50","prêt"]
["SQ12428","Mandeville","David",6854,"Poste pr Vallée-de-l'or","2006-10-23","2009-10-23","910","POLICIERS","07","AGENT SUR HOR. VAR.","09","Agent","400","Agt Sur Hor. Var."]
["SQ12428","Mandeville","David",6854,"Poste pr Vallée-de-l'or","2009-10-24","2009-11-30","910","POLICIERS","04","AGENT CL 04","09","Agent","001","Patrouilleur"]
["SQ12486","Veilleux","Dominic",6854,"Poste pr Vallée-de-l'or","2009-03-02","2009-05-30","910","POLICIERS","07","AGENT SUR HOR. VAR.","09","Agent","400","Agt Sur Hor. Var."]
["SQ12486","Veilleux","Dominic",6854,"Poste pr Vallée-de-l'or","2009-05-31","2009-06-12","910","POLICIERS","07","AGENT SUR HOR. VAR.","09","Agent","400","Agt Sur Hor. Var.","sans solde sabatique (123)"]
["SQ12486","Veilleux","Dominic",6854,"Poste pr Vallée-de-l'or","2009-06-13","2009-10-18","910","POLICIERS","07","AGENT SUR HOR. VAR.","09","Agent","400","Agt Sur Hor. Var."]
["SQ12486","Veilleux","Dominic",6854,"Poste pr Vallée-de-l'or","2009-10-19","2009-12-12","910","POLICIERS","07","AGENT SUR HOR. VAR.","09","Agent","001","Patrouilleur"]
["SQ12486","Veilleux","Dominic",6854,"Poste pr Vallée-de-l'or","2009-12-13","2010-01-01","910","POLICIERS","07","AGENT SUR HOR. VAR.","09","Agent","001","Patrouilleur","congé sans solde paternité (121)"]
["SQ12486","Veilleux","Dominic",6854,"Poste pr Vallée-de-l'or","2010-01-02","2010-04-23","910","POLICIERS","07","AGENT SUR HOR. VAR.","09","Agent","001","Patrouilleur"]
["SQ12486","Veilleux","Dominic",6854,"Poste pr Vallée-de-l'or","2010-04-24","2010-11-18","910","POLICIERS","04","AGENT CL 04","09","Agent","001","Patrouilleur"]
["SQ12486","Veilleux","Dominic",6854,"Poste pr Vallée-de-l'or","2010-11-19","2011-04-03","910","POLICIERS","04","AGENT CL 04","09","Agent","001","Patrouilleur"]
["SQ12486","Veilleux","Dominic",6854,"Poste pr Vallée-de-l'or","2011-04-04","2011-06-16","910","POLICIERS","04","AGENT CL 04","09","Agent","003","Enquêteur Poste   50","prêt"]
["SQ12486","Veilleux","Dominic",6854,"Poste pr Vallée-de-l'or","2011-06-17","2011-06-17","910","POLICIERS","04","AGENT CL 04","09","Agent","001","Patrouilleur"]
["SQ12486","Veilleux","Dominic",6854,"Poste pr Vallée-de-l'or","2011-06-18","2011-08-22","910","POLICIERS","04","AGENT CL 04","09","Agent","001","Patrouilleur"]
["SQ12486","Veilleux","Dominic",6854,"Poste pr Vallée-de-l'or","2011-08-23","2015-11-03","910","POLICIERS","04","AGENT CL 04","09","Agent","001","Patrouilleur"]
["SQ12486","Veilleux","Dominic",6854,"Poste pr Vallée-de-l'or","2015-11-04","2016-05-01","910","POLICIERS","04","AGENT CL 04","09","Agent","001","Patrouilleur","assig. Admin. (130)"]
["SQ12486","Veilleux","Dominic",7434,"Poste pr Vallée-de-l'or","2016-05-02","2016-05-03","910","POLICIERS","04","AGENT CL 04","09","Agent","001","Patrouilleur"]
["SQ12486","Veilleux","Dominic",7434,"Poste pr Vallée-de-l'or","2016-05-04","2016-11-17","910","POLICIERS","04","AGENT CL 04","09","Agent","001","Patrouilleur","assig. Admin. (130)"]
["SQ12486","Veilleux","Dominic",7434,"Poste pr Vallée-de-l'or","2016-11-18","2017-04-23","910","POLICIERS","04","AGENT CL 04","09","Agent","001","Patrouilleur"]
["SQ12486","Veilleux","Dominic",7434,"Poste pr Vallée-de-l'or","2017-04-24",null,"910","POLICIERS","12","SERGENT CL 12","07","Sergent","113","Superv De Relève"]
["SQ12518","Bélisle","Francis",6854,"Poste pr Vallée-de-l'or","2010-08-01","2010-11-18","910","POLICIERS","04","AGENT CL 04","09","Agent","001","Patrouilleur"]
["SQ12518","Bélisle","Francis",6854,"Poste pr Vallée-de-l'or","2010-11-19","2014-07-05","910","POLICIERS","04","AGENT CL 04","09","Agent","001","Patrouilleur"]
["SQ12518","Bélisle","Francis",6854,"Poste pr Vallée-de-l'or","2014-07-06","2014-07-19","910","POLICIERS","04","AGENT CL 04","09","Agent","001","Patrouilleur","congé spécial (103)"]
["SQ12518","Bélisle","Francis",6854,"Poste pr Vallée-de-l'or","2014-07-20","2014-12-20","910","POLICIERS","04","AGENT CL 04","09","Agent","001","Patrouilleur"]
["SQ12518","Bélisle","Francis",6854,"Poste pr Vallée-de-l'or","2014-12-21","2015-01-10","910","POLICIERS","04","AGENT CL 04","09","Agent","001","Patrouilleur","congé spécial (103)"]
["SQ12518","Bélisle","Francis",6854,"Poste pr Vallée-de-l'or","2015-01-11","2015-01-19","910","POLICIERS","04","AGENT CL 04","09","Agent","001","Patrouilleur"]
["SQ12529","Collin","David",6854,"Poste pr Vallée-de-l'or","2007-05-21","2009-10-19","910","POLICIERS","07","AGENT SUR HOR. VAR.","09","Agent","400","Agt Sur Hor. Var."]
["SQ12529","Collin","David",6854,"Poste pr Vallée-de-l'or","2009-10-20","2010-07-16","910","POLICIERS","07","AGENT SUR HOR. VAR.","09","Agent","001","Patrouilleur"]
["SQ12529","Collin","David",6854,"Poste pr Vallée-de-l'or","2010-07-17","2010-11-18","910","POLICIERS","04","AGENT CL 04","09","Agent","001","Patrouilleur"]
["SQ12529","Collin","David",6854,"Poste pr Vallée-de-l'or","2010-11-19","2015-08-30","910","POLICIERS","04","AGENT CL 04","09","Agent","001","Patrouilleur"]
["SQ12529","Collin","David",6854,"Poste pr Vallée-de-l'or","2015-08-31","2016-05-01","910","POLICIERS","04","AGENT CL 04","09","Agent","113","Superv De Relève","prêt"]
["SQ12529","Collin","David",7434,"Poste pr Vallée-de-l'or","2016-05-02","2016-08-14","910","POLICIERS","04","AGENT CL 04","09","Agent","113","Superv De Relève","prêt"]
["SQ12529","Collin","David",7434,"Poste pr Vallée-de-l'or","2016-08-15","2016-12-14","910","POLICIERS","04","AGENT CL 04","09","Agent","001","Patrouilleur"]
["SQ12529","Collin","David",7434,"Poste pr Vallée-de-l'or","2016-12-15","2017-11-27","910","POLICIERS","04","AGENT CL 04","09","Agent","113","Superv De Relève","prêt"]
["SQ12529","Collin","David",7434,"Poste pr Vallée-de-l'or","2017-11-28",null,"910","POLICIERS","04","AGENT CL 04","09","Agent","001","Patrouilleur"]
["SQ12594","Morin","Laurent",6854,"Poste pr Vallée-de-l'or","2011-08-01","2015-09-26","910","POLICIERS","04","AGENT CL 04","09","Agent","001","Patrouilleur"]
["SQ12594","Morin","Laurent",6854,"Poste pr Vallée-de-l'or","2015-09-27","2015-10-17","910","POLICIERS","04","AGENT CL 04","09","Agent","001","Patrouilleur","congé spécial (103)"]
["SQ12594","Morin","Laurent",6854,"Poste pr Vallée-de-l'or","2015-10-18","2016-05-01","910","POLICIERS","04","AGENT CL 04","09","Agent","001","Patrouilleur"]
["SQ12594","Morin","Laurent",7434,"Poste pr Vallée-de-l'or","2016-05-02","2016-06-25","910","POLICIERS","04","AGENT CL 04","09","Agent","001","Patrouilleur"]
["SQ12594","Morin","Laurent",7434,"Poste pr Vallée-de-l'or","2016-06-26","2016-07-23","910","POLICIERS","04","AGENT CL 04","09","Agent","001","Patrouilleur","abs sagir (110)"]
["SQ12594","Morin","Laurent",7434,"Poste pr Vallée-de-l'or","2016-07-24","2016-08-13","910","POLICIERS","04","AGENT CL 04","09","Agent","001","Patrouilleur"]
["SQ12594","Morin","Laurent",7434,"Poste pr Vallée-de-l'or","2016-08-14","2016-08-27","910","POLICIERS","04","AGENT CL 04","09","Agent","001","Patrouilleur","congé spécial (103)"]
["SQ12594","Morin","Laurent",7434,"Poste pr Vallée-de-l'or","2016-08-28","2016-11-16","910","POLICIERS","04","AGENT CL 04","09","Agent","001","Patrouilleur"]
["SQ12594","Morin","Laurent",7434,"Poste pr Vallée-de-l'or","2016-11-17","2017-07-10","910","POLICIERS","04","AGENT CL 04","09","Agent","113","Superv De Relève","prêt"]
["SQ12597","Roussil","Steve",6854,"Poste pr Vallée-de-l'or","2007-10-15","2008-04-17","910","POLICIERS","07","AGENT SUR HOR. VAR.","09","Agent","400","Agt Sur Hor. Var."]
["SQ12597","Roussil","Steve",6854,"Poste pr Vallée-de-l'or","2008-04-18","2010-10-14","910","POLICIERS","07","AGENT SUR HOR. VAR.","09","Agent","001","Patrouilleur"]
["SQ12597","Roussil","Steve",6854,"Poste pr Vallée-de-l'or","2010-10-15","2010-11-18","910","POLICIERS","04","AGENT CL 04","09","Agent","001","Patrouilleur"]
["SQ12597","Roussil","Steve",6854,"Poste pr Vallée-de-l'or","2010-11-19","2013-07-27","910","POLICIERS","04","AGENT CL 04","09","Agent","001","Patrouilleur"]
["SQ12597","Roussil","Steve",6854,"Poste pr Vallée-de-l'or","2013-07-28","2013-08-10","910","POLICIERS","04","AGENT CL 04","09","Agent","001","Patrouilleur","congé spécial (103)"]
["SQ12597","Roussil","Steve",6854,"Poste pr Vallée-de-l'or","2013-08-11","2013-09-26","910","POLICIERS","04","AGENT CL 04","09","Agent","001","Patrouilleur"]
["SQ12597","Roussil","Steve",6854,"Poste pr Vallée-de-l'or","2013-09-27","2013-10-10","910","POLICIERS","04","AGENT CL 04","09","Agent","001","Patrouilleur","acc.trav.retr.preventif (102)"]
["SQ12597","Roussil","Steve",6854,"Poste pr Vallée-de-l'or","2013-10-11","2016-05-01","910","POLICIERS","04","AGENT CL 04","09","Agent","001","Patrouilleur"]
["SQ12597","Roussil","Steve",7434,"Poste pr Vallée-de-l'or","2016-05-02","2016-05-03","910","POLICIERS","04","AGENT CL 04","09","Agent","001","Patrouilleur"]
["SQ12597","Roussil","Steve",7434,"Poste pr Vallée-de-l'or","2016-05-04","2017-11-25","910","POLICIERS","04","AGENT CL 04","09","Agent","113","Superv De Relève","prêt"]
["SQ12597","Roussil","Steve",7434,"Poste pr Vallée-de-l'or","2017-11-26","2017-12-16","910","POLICIERS","04","AGENT CL 04","09","Agent","113","Superv De Relève","congé spécial (103)"]
["SQ12597","Roussil","Steve",7434,"Poste pr Vallée-de-l'or","2017-12-17",null,"910","POLICIERS","04","AGENT CL 04","09","Agent","113","Superv De Relève","prêt"]
["SQ12603","Naud","Patrick",6854,"Poste pr Vallée-de-l'or","2007-10-15","2010-10-14","910","POLICIERS","07","AGENT SUR HOR. VAR.","09","Agent","400","Agt Sur Hor. Var."]
["SQ12603","Naud","Patrick",6854,"Poste pr Vallée-de-l'or","2010-10-15","2010-11-18","910","POLICIERS","04","AGENT CL 04","09","Agent","001","Patrouilleur"]
["SQ12603","Naud","Patrick",6854,"Poste pr Vallée-de-l'or","2010-11-19","2011-07-16","910","POLICIERS","04","AGENT CL 04","09","Agent","001","Patrouilleur"]
["SQ12603","Naud","Patrick",6854,"Poste pr Vallée-de-l'or","2011-07-17","2011-07-30","910","POLICIERS","04","AGENT CL 04","09","Agent","001","Patrouilleur","abs sagir (110)"]
["SQ12603","Naud","Patrick",6854,"Poste pr Vallée-de-l'or","2011-07-31","2011-12-24","910","POLICIERS","04","AGENT CL 04","09","Agent","001","Patrouilleur"]
["SQ12603","Naud","Patrick",6854,"Poste pr Vallée-de-l'or","2011-12-25","2012-01-14","910","POLICIERS","04","AGENT CL 04","09","Agent","001","Patrouilleur","abs sagir (110)"]
["SQ12603","Naud","Patrick",6854,"Poste pr Vallée-de-l'or","2012-01-15","2015-07-04","910","POLICIERS","04","AGENT CL 04","09","Agent","001","Patrouilleur"]
["SQ12603","Naud","Patrick",6854,"Poste pr Vallée-de-l'or","2015-07-05","2015-07-18","910","POLICIERS","04","AGENT CL 04","09","Agent","001","Patrouilleur","congé spécial (103)"]
["SQ12603","Naud","Patrick",6854,"Poste pr Vallée-de-l'or","2015-07-19","2015-12-19","910","POLICIERS","04","AGENT CL 04","09","Agent","001","Patrouilleur"]
["SQ12603","Naud","Patrick",6854,"Poste pr Vallée-de-l'or","2015-12-20","2016-01-09","910","POLICIERS","04","AGENT CL 04","09","Agent","001","Patrouilleur","congé spécial (103)"]
["SQ12603","Naud","Patrick",6854,"Poste pr Vallée-de-l'or","2016-01-10","2016-05-01","910","POLICIERS","04","AGENT CL 04","09","Agent","001","Patrouilleur"]
["SQ12603","Naud","Patrick",7434,"Poste pr Vallée-de-l'or","2016-05-02",null,"910","POLICIERS","04","AGENT CL 04","09","Agent","001","Patrouilleur"]
["SQ12604","Bédard","Alexandre",6854,"Poste pr Vallée-de-l'or","2007-10-15","2008-04-17","910","POLICIERS","07","AGENT SUR HOR. VAR.","09","Agent","400","Agt Sur Hor. Var."]
["SQ12604","Bédard","Alexandre",6854,"Poste pr Vallée-de-l'or","2008-04-18","2010-10-14","910","POLICIERS","07","AGENT SUR HOR. VAR.","09","Agent","001","Patrouilleur"]
["SQ12604","Bédard","Alexandre",6854,"Poste pr Vallée-de-l'or","2010-10-15","2010-11-18","910","POLICIERS","04","AGENT CL 04","09","Agent","001","Patrouilleur"]
["SQ12604","Bédard","Alexandre",6854,"Poste pr Vallée-de-l'or","2010-11-19","2011-04-16","910","POLICIERS","04","AGENT CL 04","09","Agent","001","Patrouilleur"]
["SQ12604","Bédard","Alexandre",6854,"Poste pr Vallée-de-l'or","2011-04-17","2011-05-07","910","POLICIERS","04","AGENT CL 04","09","Agent","001","Patrouilleur","abs sagir (110)"]
["SQ12604","Bédard","Alexandre",6854,"Poste pr Vallée-de-l'or","2011-05-08","2011-12-24","910","POLICIERS","04","AGENT CL 04","09","Agent","001","Patrouilleur"]
["SQ12604","Bédard","Alexandre",6854,"Poste pr Vallée-de-l'or","2011-12-25","2012-01-07","910","POLICIERS","04","AGENT CL 04","09","Agent","001","Patrouilleur","abs sagir (110)"]
["SQ12604","Bédard","Alexandre",6854,"Poste pr Vallée-de-l'or","2012-01-08","2012-07-09","910","POLICIERS","04","AGENT CL 04","09","Agent","001","Patrouilleur"]
["SQ12644","Poitras","Valérie",6854,"Poste pr Vallée-de-l'or","2011-01-28","2012-01-10","910","POLICIERS","04","AGENT CL 04","09","Agent","001","Patrouilleur"]
["SQ12644","Poitras","Valérie",6854,"Poste pr Vallée-de-l'or","2012-01-11","2012-08-02","910","POLICIERS","04","AGENT CL 04","09","Agent","001","Patrouilleur","retrait préventif (118)"]
["SQ12644","Poitras","Valérie",6854,"Poste pr Vallée-de-l'or","2012-08-03","2012-08-04","910","POLICIERS","04","AGENT CL 04","09","Agent","001","Patrouilleur"]
["SQ12644","Poitras","Valérie",6854,"Poste pr Vallée-de-l'or","2012-08-05","2012-12-19","910","POLICIERS","04","AGENT CL 04","09","Agent","001","Patrouilleur","maternité (120)"]
["SQ12644","Poitras","Valérie",6854,"Poste pr Vallée-de-l'or","2012-12-20","2013-07-13","910","POLICIERS","04","AGENT CL 04","09","Agent","001","Patrouilleur","abs sagir (110)"]
["SQ12644","Poitras","Valérie",6854,"Poste pr Vallée-de-l'or","2013-07-14","2014-02-01","910","POLICIERS","04","AGENT CL 04","09","Agent","001","Patrouilleur"]
["SQ12644","Poitras","Valérie",6854,"Poste pr Vallée-de-l'or","2014-02-02","2014-06-23","910","POLICIERS","04","AGENT CL 04","09","Agent","001","Patrouilleur","maternité (120)"]
["SQ12758","Boucher","Philippe",6854,"Poste pr Vallée-de-l'or","2008-04-21","2010-10-15","910","POLICIERS","07","AGENT SUR HOR. VAR.","09","Agent","400","Agt Sur Hor. Var."]
["SQ12758","Boucher","Philippe",6854,"Poste pr Vallée-de-l'or","2010-10-16","2010-11-18","910","POLICIERS","07","AGENT SUR HOR. VAR.","09","Agent","001","Patrouilleur"]
["SQ12758","Boucher","Philippe",6854,"Poste pr Vallée-de-l'or","2010-11-19","2011-03-31","910","POLICIERS","07","AGENT SUR HOR. VAR.","09","Agent","001","Patrouilleur"]
["SQ12758","Boucher","Philippe",6854,"Poste pr Vallée-de-l'or","2011-04-01","2011-07-23","910","POLICIERS","04","AGENT CL 04","09","Agent","001","Patrouilleur"]
["SQ12776","Fortier","Benoît",6854,"Poste pr Vallée-de-l'or","2008-04-21","2010-11-18","910","POLICIERS","07","AGENT SUR HOR. VAR.","09","Agent","400","Agt Sur Hor. Var."]
["SQ12776","Fortier","Benoît",6854,"Poste pr Vallée-de-l'or","2010-11-19","2011-04-20","910","POLICIERS","07","AGENT SUR HOR. VAR.","09","Agent","400","Agt Sur Hor. Var."]
["SQ12776","Fortier","Benoît",6854,"Poste pr Vallée-de-l'or","2011-04-21","2014-08-30","910","POLICIERS","04","AGENT CL 04","09","Agent","001","Patrouilleur"]
["SQ12776","Fortier","Benoît",6854,"Poste pr Vallée-de-l'or","2014-08-31","2014-09-20","910","POLICIERS","04","AGENT CL 04","09","Agent","001","Patrouilleur","congé spécial (103)"]
["SQ12776","Fortier","Benoît",6854,"Poste pr Vallée-de-l'or","2014-09-21","2015-01-10","910","POLICIERS","04","AGENT CL 04","09","Agent","001","Patrouilleur"]
["SQ12776","Fortier","Benoît",6854,"Poste pr Vallée-de-l'or","2015-01-11","2015-01-24","910","POLICIERS","04","AGENT CL 04","09","Agent","001","Patrouilleur","congé spécial (103)"]
["SQ12776","Fortier","Benoît",6854,"Poste pr Vallée-de-l'or","2015-01-25","2015-07-11","910","POLICIERS","04","AGENT CL 04","09","Agent","001","Patrouilleur"]
["SQ12776","Fortier","Benoît",6854,"Poste pr Vallée-de-l'or","2015-07-12","2015-07-25","910","POLICIERS","04","AGENT CL 04","09","Agent","001","Patrouilleur","congé spécial (103)"]
["SQ12776","Fortier","Benoît",6854,"Poste pr Vallée-de-l'or","2015-07-26","2016-05-01","910","POLICIERS","04","AGENT CL 04","09","Agent","001","Patrouilleur"]
["SQ12776","Fortier","Benoît",7434,"Poste pr Vallée-de-l'or","2016-05-02","2016-07-30","910","POLICIERS","04","AGENT CL 04","09","Agent","001","Patrouilleur"]
["SQ12776","Fortier","Benoît",7434,"Poste pr Vallée-de-l'or","2016-07-31","2016-08-13","910","POLICIERS","04","AGENT CL 04","09","Agent","001","Patrouilleur","congé spécial (103)"]
["SQ12776","Fortier","Benoît",7434,"Poste pr Vallée-de-l'or","2016-08-14",null,"910","POLICIERS","04","AGENT CL 04","09","Agent","001","Patrouilleur"]
["SQ12780","Venne","Christian",6854,"Poste pr Vallée-de-l'or","2008-05-19","2008-05-19","910","POLICIERS","07","AGENT SUR HOR. VAR.","09","Agent","001","Patrouilleur"]
["SQ12780","Venne","Christian",6854,"Poste pr Vallée-de-l'or","2008-05-20","2010-11-18","910","POLICIERS","07","AGENT SUR HOR. VAR.","09","Agent","001","Patrouilleur"]
["SQ12780","Venne","Christian",6854,"Poste pr Vallée-de-l'or","2010-11-19","2011-02-07","910","POLICIERS","07","AGENT SUR HOR. VAR.","09","Agent","001","Patrouilleur"]
["SQ12780","Venne","Christian",6854,"Poste pr Vallée-de-l'or","2011-02-08","2011-06-04","910","POLICIERS","07","AGENT SUR HOR. VAR.","09","Agent","001","Patrouilleur"]
["SQ12780","Venne","Christian",6854,"Poste pr Vallée-de-l'or","2011-06-05","2012-03-28","910","POLICIERS","04","AGENT CL 04","09","Agent","001","Patrouilleur"]
["SQ12780","Venne","Christian",6854,"Poste pr Vallée-de-l'or","2012-03-29","2015-07-18","910","POLICIERS","04","AGENT CL 04","09","Agent","001","Patrouilleur"]
["SQ12780","Venne","Christian",6854,"Poste pr Vallée-de-l'or","2015-07-19","2015-08-22","910","POLICIERS","04","AGENT CL 04","09","Agent","001","Patrouilleur","congé spécial (103)"]
["SQ12780","Venne","Christian",6854,"Poste pr Vallée-de-l'or","2015-08-23","2016-05-01","910","POLICIERS","04","AGENT CL 04","09","Agent","001","Patrouilleur"]
["SQ12780","Venne","Christian",7434,"Poste pr Vallée-de-l'or","2016-05-02","2017-12-09","910","POLICIERS","04","AGENT CL 04","09","Agent","001","Patrouilleur"]
["SQ12780","Venne","Christian",7434,"Poste pr Vallée-de-l'or","2017-12-10","2018-01-13","910","POLICIERS","04","AGENT CL 04","09","Agent","001","Patrouilleur","congé spécial (103)"]
["SQ12780","Venne","Christian",7434,"Poste pr Vallée-de-l'or","2018-01-14",null,"910","POLICIERS","04","AGENT CL 04","09","Agent","001","Patrouilleur"]
["SQ12786","Lemieux","Vincent",6854,"Poste pr Vallée-de-l'or","2012-08-21","2013-02-02","910","POLICIERS","04","AGENT CL 04","09","Agent","001","Patrouilleur"]
["SQ12786","Lemieux","Vincent",6854,"Poste pr Vallée-de-l'or","2013-02-03","2013-04-20","910","POLICIERS","04","AGENT CL 04","09","Agent","001","Patrouilleur","abs sagir (110)"]
["SQ12786","Lemieux","Vincent",6854,"Poste pr Vallée-de-l'or","2013-04-21","2013-12-21","910","POLICIERS","04","AGENT CL 04","09","Agent","001","Patrouilleur"]
["SQ12786","Lemieux","Vincent",6854,"Poste pr Vallée-de-l'or","2013-12-22","2014-01-04","910","POLICIERS","04","AGENT CL 04","09","Agent","001","Patrouilleur","congé spécial (103)"]
["SQ12786","Lemieux","Vincent",6854,"Poste pr Vallée-de-l'or","2014-01-05","2016-05-01","910","POLICIERS","04","AGENT CL 04","09","Agent","001","Patrouilleur"]
["SQ12786","Lemieux","Vincent",7434,"Poste pr Vallée-de-l'or","2016-05-02",null,"910","POLICIERS","04","AGENT CL 04","09","Agent","001","Patrouilleur"]
["SQ12790","Tanguay","Bernard",6854,"Poste pr Vallée-de-l'or","2008-05-19","2009-07-29","910","POLICIERS","07","AGENT SUR HOR. VAR.","09","Agent","001","Patrouilleur"]
["SQ12790","Tanguay","Bernard",6854,"Poste pr Vallée-de-l'or","2009-07-30","2010-11-18","910","POLICIERS","07","AGENT SUR HOR. VAR.","09","Agent","400","Agt Sur Hor. Var."]
["SQ12790","Tanguay","Bernard",6854,"Poste pr Vallée-de-l'or","2010-11-19","2011-05-18","910","POLICIERS","07","AGENT SUR HOR. VAR.","09","Agent","400","Agt Sur Hor. Var."]
["SQ12790","Tanguay","Bernard",6854,"Poste pr Vallée-de-l'or","2011-05-19","2011-09-22","910","POLICIERS","04","AGENT CL 04","09","Agent","400","Agt Sur Hor. Var."]
["SQ12802","Lafleur","Maxime",6854,"Poste pr Vallée-de-l'or","2012-08-14","2016-05-01","910","POLICIERS","04","AGENT CL 04","09","Agent","001","Patrouilleur"]
["SQ12802","Lafleur","Maxime",7434,"Poste pr Vallée-de-l'or","2016-05-02","2016-12-05","910","POLICIERS","04","AGENT CL 04","09","Agent","001","Patrouilleur"]
["SQ12827","Doyon","Carl",6854,"Poste pr Vallée-de-l'or","2008-07-14","2010-11-18","910","POLICIERS","07","AGENT SUR HOR. VAR.","09","Agent","400","Agt Sur Hor. Var."]
["SQ12827","Doyon","Carl",6854,"Poste pr Vallée-de-l'or","2010-11-19","2011-07-13","910","POLICIERS","07","AGENT SUR HOR. VAR.","09","Agent","400","Agt Sur Hor. Var."]
["SQ12827","Doyon","Carl",6854,"Poste pr Vallée-de-l'or","2011-07-14","2011-10-01","910","POLICIERS","04","AGENT CL 04","09","Agent","400","Agt Sur Hor. Var."]
["SQ12827","Doyon","Carl",6854,"Poste pr Vallée-de-l'or","2011-10-02","2011-10-22","910","POLICIERS","04","AGENT CL 04","09","Agent","400","Agt Sur Hor. Var.","abs sagir (110)"]
["SQ12827","Doyon","Carl",6854,"Poste pr Vallée-de-l'or","2011-10-23","2011-11-19","910","POLICIERS","04","AGENT CL 04","09","Agent","400","Agt Sur Hor. Var."]
["SQ12827","Doyon","Carl",6854,"Poste pr Vallée-de-l'or","2011-11-20","2011-12-03","910","POLICIERS","04","AGENT CL 04","09","Agent","400","Agt Sur Hor. Var.","abs sagir (110)"]
["SQ12827","Doyon","Carl",6854,"Poste pr Vallée-de-l'or","2011-12-04","2012-03-30","910","POLICIERS","04","AGENT CL 04","09","Agent","400","Agt Sur Hor. Var."]
["SQ12827","Doyon","Carl",6854,"Poste pr Vallée-de-l'or","2012-03-31","2013-02-02","910","POLICIERS","04","AGENT CL 04","09","Agent","001","Patrouilleur"]
["SQ12827","Doyon","Carl",6854,"Poste pr Vallée-de-l'or","2013-02-03","2013-02-16","910","POLICIERS","04","AGENT CL 04","09","Agent","001","Patrouilleur","congé spécial (103)"]
["SQ12827","Doyon","Carl",6854,"Poste pr Vallée-de-l'or","2013-02-17","2013-04-06","910","POLICIERS","04","AGENT CL 04","09","Agent","001","Patrouilleur"]
["SQ12827","Doyon","Carl",6854,"Poste pr Vallée-de-l'or","2013-04-07","2013-04-27","910","POLICIERS","04","AGENT CL 04","09","Agent","001","Patrouilleur","congé spécial (103)"]
["SQ12827","Doyon","Carl",6854,"Poste pr Vallée-de-l'or","2013-04-28","2013-12-07","910","POLICIERS","04","AGENT CL 04","09","Agent","001","Patrouilleur"]
["SQ12827","Doyon","Carl",6854,"Poste pr Vallée-de-l'or","2013-12-08","2013-12-28","910","POLICIERS","04","AGENT CL 04","09","Agent","001","Patrouilleur","congé spécial (103)"]
["SQ12827","Doyon","Carl",6854,"Poste pr Vallée-de-l'or","2013-12-29","2016-05-01","910","POLICIERS","04","AGENT CL 04","09","Agent","001","Patrouilleur"]
["SQ12827","Doyon","Carl",7434,"Poste pr Vallée-de-l'or","2016-05-02","2017-03-28","910","POLICIERS","04","AGENT CL 04","09","Agent","001","Patrouilleur"]
["SQ12851","Labrecque","Maxime",6854,"Poste pr Vallée-de-l'or","2008-07-14","2010-11-18","910","POLICIERS","07","AGENT SUR HOR. VAR.","09","Agent","400","Agt Sur Hor. Var."]
["SQ12851","Labrecque","Maxime",6854,"Poste pr Vallée-de-l'or","2010-11-19","2011-07-13","910","POLICIERS","07","AGENT SUR HOR. VAR.","09","Agent","400","Agt Sur Hor. Var."]
["SQ12851","Labrecque","Maxime",6854,"Poste pr Vallée-de-l'or","2011-07-14","2012-06-18","910","POLICIERS","04","AGENT CL 04","09","Agent","400","Agt Sur Hor. Var."]
["SQ12851","Labrecque","Maxime",6854,"Poste pr Vallée-de-l'or","2012-06-19","2014-01-25","910","POLICIERS","04","AGENT CL 04","09","Agent","001","Patrouilleur"]
["SQ12851","Labrecque","Maxime",6854,"Poste pr Vallée-de-l'or","2014-01-26","2014-02-15","910","POLICIERS","04","AGENT CL 04","09","Agent","001","Patrouilleur"]
["SQ12851","Labrecque","Maxime",6854,"Poste pr Vallée-de-l'or","2014-02-16","2014-08-02","910","POLICIERS","04","AGENT CL 04","09","Agent","001","Patrouilleur"]
["SQ12851","Labrecque","Maxime",6854,"Poste pr Vallée-de-l'or","2014-08-03","2014-08-16","910","POLICIERS","04","AGENT CL 04","09","Agent","001","Patrouilleur","congé spécial (103)"]
["SQ12851","Labrecque","Maxime",6854,"Poste pr Vallée-de-l'or","2014-08-17","2016-05-01","910","POLICIERS","04","AGENT CL 04","09","Agent","001","Patrouilleur"]
["SQ12851","Labrecque","Maxime",7434,"Poste pr Vallée-de-l'or","2016-05-02","2017-04-15","910","POLICIERS","04","AGENT CL 04","09","Agent","001","Patrouilleur"]
["SQ12851","Labrecque","Maxime",7434,"Poste pr Vallée-de-l'or","2017-04-16","2017-05-06","910","POLICIERS","04","AGENT CL 04","09","Agent","001","Patrouilleur","congé spécial (103)"]
["SQ12851","Labrecque","Maxime",7434,"Poste pr Vallée-de-l'or","2017-05-07","2017-08-28","910","POLICIERS","04","AGENT CL 04","09","Agent","001","Patrouilleur"]
["SQ12871","Gervais","Martin",6854,"Poste pr Vallée-de-l'or","2008-09-22","2009-07-28","910","POLICIERS","07","AGENT SUR HOR. VAR.","09","Agent","001","Patrouilleur"]
["SQ12871","Gervais","Martin",6854,"Poste pr Vallée-de-l'or","2009-07-29","2010-06-12","910","POLICIERS","07","AGENT SUR HOR. VAR.","09","Agent","400","Agt Sur Hor. Var."]
["SQ12871","Gervais","Martin",6854,"Poste pr Vallée-de-l'or","2010-06-13","2010-06-26","910","POLICIERS","07","AGENT SUR HOR. VAR.","09","Agent","400","Agt Sur Hor. Var.","congé sans solde paternité (121)"]
["SQ12871","Gervais","Martin",6854,"Poste pr Vallée-de-l'or","2010-06-27","2010-11-18","910","POLICIERS","07","AGENT SUR HOR. VAR.","09","Agent","400","Agt Sur Hor. Var."]
["SQ12871","Gervais","Martin",6854,"Poste pr Vallée-de-l'or","2010-11-19","2010-12-18","910","POLICIERS","07","AGENT SUR HOR. VAR.","09","Agent","400","Agt Sur Hor. Var."]
["SQ12871","Gervais","Martin",6854,"Poste pr Vallée-de-l'or","2010-12-19","2011-01-08","910","POLICIERS","07","AGENT SUR HOR. VAR.","09","Agent","400","Agt Sur Hor. Var.","abs sagir (110)"]
["SQ12871","Gervais","Martin",6854,"Poste pr Vallée-de-l'or","2011-01-09","2011-09-21","910","POLICIERS","07","AGENT SUR HOR. VAR.","09","Agent","400","Agt Sur Hor. Var."]
["SQ12871","Gervais","Martin",6854,"Poste pr Vallée-de-l'or","2011-09-22","2012-10-27","910","POLICIERS","04","AGENT CL 04","09","Agent","400","Agt Sur Hor. Var."]
["SQ12871","Gervais","Martin",6854,"Poste pr Vallée-de-l'or","2012-10-28","2012-11-12","910","POLICIERS","04","AGENT CL 04","09","Agent","400","Agt Sur Hor. Var.","congé spécial (103)"]
["SQ12905","Drouin","Simon",6854,"Poste pr Vallée-de-l'or","2012-07-24","2015-08-01","910","POLICIERS","04","AGENT CL 04","09","Agent","001","Patrouilleur"]
["SQ12905","Drouin","Simon",6854,"Poste pr Vallée-de-l'or","2015-08-02","2015-09-05","910","POLICIERS","04","AGENT CL 04","09","Agent","001","Patrouilleur","congé spécial (103)"]
["SQ12905","Drouin","Simon",6854,"Poste pr Vallée-de-l'or","2015-09-06","2015-11-03","910","POLICIERS","04","AGENT CL 04","09","Agent","001","Patrouilleur"]
["SQ12905","Drouin","Simon",6854,"Poste pr Vallée-de-l'or","2015-11-04","2016-05-01","910","POLICIERS","04","AGENT CL 04","09","Agent","001","Patrouilleur","assig. Admin. (130)"]
["SQ12905","Drouin","Simon",7434,"Poste pr Vallée-de-l'or","2016-05-02","2016-09-05","910","POLICIERS","04","AGENT CL 04","09","Agent","001","Patrouilleur"]
["SQ12959","Gosselin","Benoît",6854,"Poste pr Vallée-de-l'or","2013-03-05","2014-12-13","910","POLICIERS","04","AGENT CL 04","09","Agent","001","Patrouilleur"]
["SQ12959","Gosselin","Benoît",6854,"Poste pr Vallée-de-l'or","2014-12-14","2015-01-03","910","POLICIERS","04","AGENT CL 04","09","Agent","001","Patrouilleur","congé spécial (103)"]
["SQ12959","Gosselin","Benoît",6854,"Poste pr Vallée-de-l'or","2015-01-04","2016-05-01","910","POLICIERS","04","AGENT CL 04","09","Agent","001","Patrouilleur"]
["SQ12959","Gosselin","Benoît",7434,"Poste pr Vallée-de-l'or","2016-05-02","2016-07-31","910","POLICIERS","04","AGENT CL 04","09","Agent","001","Patrouilleur"]
["SQ12989","Drolet","Jean Raphaël",6854,"Poste pr Vallée-de-l'or","2012-11-01","2015-11-03","910","POLICIERS","04","AGENT CL 04","09","Agent","001","Patrouilleur"]
["SQ12989","Drolet","Jean Raphaël",6854,"Poste pr Vallée-de-l'or","2015-11-04","2016-03-24","910","POLICIERS","04","AGENT CL 04","09","Agent","001","Patrouilleur","assig. Admin. (130)"]
["SQ12989","Drolet","Jean Raphaël",6854,"Poste pr Vallée-de-l'or","2016-03-25","2016-05-01","910","POLICIERS","04","AGENT CL 04","09","Agent","001","Patrouilleur"]
["SQ12989","Drolet","Jean Raphaël",7434,"Poste pr Vallée-de-l'or","2016-05-02","2017-02-12","910","POLICIERS","04","AGENT CL 04","09","Agent","001","Patrouilleur"]
["SQ12989","Drolet","Jean Raphaël",7434,"Poste pr Vallée-de-l'or","2017-02-13",null,"910","POLICIERS","04","AGENT CL 04","09","Agent","034","Agent Rel Communaut","prêt"]
["SQ13015","Turcotte","François",6854,"Poste pr Vallée-de-l'or","2013-05-01","2016-05-01","910","POLICIERS","04","AGENT CL 04","09","Agent","001","Patrouilleur"]
["SQ13015","Turcotte","François",7434,"Poste pr Vallée-de-l'or","2016-05-02","2017-06-05","910","POLICIERS","04","AGENT CL 04","09","Agent","001","Patrouilleur"]
["SQ13024","Morin","Guillaume",6854,"Poste pr Vallée-de-l'or","2013-05-14","2013-05-14","910","POLICIERS","07","AGENT SUR HOR. VAR.","09","Agent","001","Patrouilleur"]
["SQ13024","Morin","Guillaume",6854,"Poste pr Vallée-de-l'or","2013-05-15","2013-06-22","910","POLICIERS","04","AGENT CL 04","09","Agent","001","Patrouilleur"]
["SQ13024","Morin","Guillaume",6854,"Poste pr Vallée-de-l'or","2013-06-23","2013-07-13","910","POLICIERS","04","AGENT CL 04","09","Agent","001","Patrouilleur","congé spécial (103)"]
["SQ13024","Morin","Guillaume",6854,"Poste pr Vallée-de-l'or","2013-07-14","2014-01-04","910","POLICIERS","04","AGENT CL 04","09","Agent","001","Patrouilleur","abs sagir (110)"]
["SQ13024","Morin","Guillaume",6854,"Poste pr Vallée-de-l'or","2014-01-05","2016-05-01","910","POLICIERS","04","AGENT CL 04","09","Agent","001","Patrouilleur"]
["SQ13024","Morin","Guillaume",7434,"Poste pr Vallée-de-l'or","2016-05-02","2017-08-07","910","POLICIERS","04","AGENT CL 04","09","Agent","001","Patrouilleur"]
["SQ13025","Dorval","Stéphanie",6854,"Poste pr Vallée-de-l'or","2016-04-02","2016-05-01","910","POLICIERS","04","AGENT CL 04","09","Agent","501","Patrouilleur"]
["SQ13025","Dorval","Stéphanie",7434,"Poste pr Vallée-de-l'or","2016-05-02",null,"910","POLICIERS","04","AGENT CL 04","09","Agent","501","Patrouilleur"]
["SQ13117","Gagnier","Pierre Carlos",6854,"Poste pr Vallée-de-l'or","2009-10-19","2010-11-18","910","POLICIERS","07","AGENT SUR HOR. VAR.","09","Agent","400","Agt Sur Hor. Var."]
["SQ13117","Gagnier","Pierre Carlos",6854,"Poste pr Vallée-de-l'or","2010-11-19","2012-10-19","910","POLICIERS","07","AGENT SUR HOR. VAR.","09","Agent","400","Agt Sur Hor. Var."]
["SQ13117","Gagnier","Pierre Carlos",6854,"Poste pr Vallée-de-l'or","2012-10-20","2013-10-31","910","POLICIERS","04","AGENT CL 04","09","Agent","400","Agt Sur Hor. Var."]
["SQ13117","Gagnier","Pierre Carlos",6854,"Poste pr Vallée-de-l'or","2016-03-01","2016-05-01","910","POLICIERS","04","AGENT CL 04","09","Agent","501","Patrouilleur"]
["SQ13117","Gagnier","Pierre Carlos",7434,"Poste pr Vallée-de-l'or","2016-05-02","2016-05-31","910","POLICIERS","04","AGENT CL 04","09","Agent","501","Patrouilleur"]
["SQ13117","Gagnier","Pierre Carlos",7434,"Poste pr Vallée-de-l'or","2016-06-01","2016-09-11","910","POLICIERS","04","AGENT CL 04","09","Agent","501","Patrouilleur","abs sagir (110)"]
["SQ13117","Gagnier","Pierre Carlos",7434,"Poste pr Vallée-de-l'or","2016-09-12","2016-09-13","910","POLICIERS","04","AGENT CL 04","09","Agent","501","Patrouilleur"]
["SQ13117","Gagnier","Pierre Carlos",7434,"Poste pr Vallée-de-l'or","2016-09-14","2017-03-25","910","POLICIERS","04","AGENT CL 04","09","Agent","501","Patrouilleur","abs sagir (110)"]
["SQ13117","Gagnier","Pierre Carlos",7434,"Poste pr Vallée-de-l'or","2017-03-26","2017-04-29","910","POLICIERS","04","AGENT CL 04","09","Agent","501","Patrouilleur","congé spécial (103)"]
["SQ13117","Gagnier","Pierre Carlos",7434,"Poste pr Vallée-de-l'or","2017-04-30",null,"910","POLICIERS","04","AGENT CL 04","09","Agent","501","Patrouilleur","abs sagir (110)"]
["SQ13138","Laflamme","Jimmy",6854,"Poste pr Vallée-de-l'or","2009-11-16","2010-11-18","910","POLICIERS","07","AGENT SUR HOR. VAR.","09","Agent","400","Agt Sur Hor. Var."]
["SQ13138","Laflamme","Jimmy",6854,"Poste pr Vallée-de-l'or","2010-11-19","2012-11-16","910","POLICIERS","07","AGENT SUR HOR. VAR.","09","Agent","400","Agt Sur Hor. Var."]
["SQ13138","Laflamme","Jimmy",6854,"Poste pr Vallée-de-l'or","2012-11-17","2013-07-31","910","POLICIERS","04","AGENT CL 04","09","Agent","400","Agt Sur Hor. Var."]
["SQ13156","Allard","Jean-Pierre",6854,"Poste pr Vallée-de-l'or","2009-12-14","2010-11-18","910","POLICIERS","07","AGENT SUR HOR. VAR.","09","Agent","400","Agt Sur Hor. Var."]
["SQ13156","Allard","Jean-Pierre",6854,"Poste pr Vallée-de-l'or","2010-11-19","2012-12-14","910","POLICIERS","07","AGENT SUR HOR. VAR.","09","Agent","405","Patr. Var. (Rés.Comm"]
["SQ13156","Allard","Jean-Pierre",6854,"Poste pr Vallée-de-l'or","2012-12-15","2013-06-12","910","POLICIERS","04","AGENT CL 04","09","Agent","405","Patr. Var. (Rés.Comm"]
["SQ13201","Tanguay-Lévesque","Jean-François",6854,"Poste pr Vallée-de-l'or","2010-02-15","2010-11-18","910","POLICIERS","07","AGENT SUR HOR. VAR.","09","Agent","400","Agt Sur Hor. Var."]
["SQ13201","Tanguay-Lévesque","Jean-François",6854,"Poste pr Vallée-de-l'or","2010-11-19","2013-02-15","910","POLICIERS","07","AGENT SUR HOR. VAR.","09","Agent","400","Agt Sur Hor. Var."]
["SQ13201","Tanguay-Lévesque","Jean-François",6854,"Poste pr Vallée-de-l'or","2013-02-16","2013-10-31","910","POLICIERS","04","AGENT CL 04","09","Agent","400","Agt Sur Hor. Var."]
["SQ13248","Lévesque","Catherine",6854,"Poste pr Vallée-de-l'or","2013-12-01","2016-05-01","910","POLICIERS","04","AGENT CL 04","09","Agent","001","Patrouilleur"]
["SQ13248","Lévesque","Catherine",7434,"Poste pr Vallée-de-l'or","2016-05-02",null,"910","POLICIERS","04","AGENT CL 04","09","Agent","001","Patrouilleur"]
["SQ13281","Meunier","Dany",6854,"Poste pr Vallée-de-l'or","2010-04-26","2010-11-18","910","POLICIERS","07","AGENT SUR HOR. VAR.","09","Agent","400","Agt Sur Hor. Var."]
["SQ13281","Meunier","Dany",6854,"Poste pr Vallée-de-l'or","2010-11-19","2014-02-06","910","POLICIERS","07","AGENT SUR HOR. VAR.","09","Agent","400","Agt Sur Hor. Var."]
["SQ13281","Meunier","Dany",6854,"Poste pr Vallée-de-l'or","2014-02-07","2016-05-01","910","POLICIERS","04","AGENT CL 04","09","Agent","001","Patrouilleur"]
["SQ13281","Meunier","Dany",7434,"Poste pr Vallée-de-l'or","2016-05-02","2016-06-25","910","POLICIERS","04","AGENT CL 04","09","Agent","001","Patrouilleur"]
["SQ13281","Meunier","Dany",7434,"Poste pr Vallée-de-l'or","2016-06-26","2016-07-30","910","POLICIERS","04","AGENT CL 04","09","Agent","001","Patrouilleur","congé spécial (103)"]
["SQ13281","Meunier","Dany",7434,"Poste pr Vallée-de-l'or","2016-07-31","2017-09-23","910","POLICIERS","04","AGENT CL 04","09","Agent","001","Patrouilleur"]
["SQ13281","Meunier","Dany",7434,"Poste pr Vallée-de-l'or","2017-09-24","2017-09-30","910","POLICIERS","04","AGENT CL 04","09","Agent","001","Patrouilleur","abs sagir (110)"]
["SQ13281","Meunier","Dany",7434,"Poste pr Vallée-de-l'or","2017-10-01","2017-11-25","910","POLICIERS","04","AGENT CL 04","09","Agent","001","Patrouilleur"]
["SQ13281","Meunier","Dany",7434,"Poste pr Vallée-de-l'or","2017-11-26","2017-12-31","910","POLICIERS","04","AGENT CL 04","09","Agent","001","Patrouilleur","abs sagir (110)"]
["SQ13281","Meunier","Dany",7434,"Poste pr Vallée-de-l'or","2018-01-01",null,"910","POLICIERS","04","AGENT CL 04","09","Agent","001","Patrouilleur"]
["SQ13308","St-Jean-Bisson","Ian",6854,"Poste pr Vallée-de-l'or","2010-05-31","2010-11-18","910","POLICIERS","07","AGENT SUR HOR. VAR.","09","Agent","400","Agt Sur Hor. Var."]
["SQ13308","St-Jean-Bisson","Ian",6854,"Poste pr Vallée-de-l'or","2010-11-19","2013-05-31","910","POLICIERS","07","AGENT SUR HOR. VAR.","09","Agent","400","Agt Sur Hor. Var."]
["SQ13355","Nolin","Jonathan-Pierre",6854,"Poste pr Vallée-de-l'or","2010-09-20","2010-11-18","910","POLICIERS","07","AGENT SUR HOR. VAR.","09","Agent","400","Agt Sur Hor. Var."]
["SQ13355","Nolin","Jonathan-Pierre",6854,"Poste pr Vallée-de-l'or","2010-11-19","2013-12-12","910","POLICIERS","07","AGENT SUR HOR. VAR.","09","Agent","400","Agt Sur Hor. Var."]
["SQ13355","Nolin","Jonathan-Pierre",6854,"Poste pr Vallée-de-l'or","2013-12-13","2014-04-14","910","POLICIERS","04","AGENT CL 04","09","Agent","001","Patrouilleur"]
["SQ13370","Corriveau","Vincent",6854,"Poste pr Vallée-de-l'or","2016-04-19","2016-05-01","910","POLICIERS","04","AGENT CL 04","09","Agent","501","Patrouilleur"]
["SQ13384","Roy","Julie-Anne",6854,"Poste pr Vallée-de-l'or","2015-01-27","2016-05-01","910","POLICIERS","04","AGENT CL 04","09","Agent","001","Patrouilleur"]
["SQ13384","Roy","Julie-Anne",7434,"Poste pr Vallée-de-l'or","2016-05-02","2016-12-31","910","POLICIERS","04","AGENT CL 04","09","Agent","001","Patrouilleur"]
["SQ13384","Roy","Julie-Anne",7434,"Poste pr Vallée-de-l'or","2017-01-01","2017-05-27","910","POLICIERS","04","AGENT CL 04","09","Agent","001","Patrouilleur","maternité (120)"]
["SQ13384","Roy","Julie-Anne",7434,"Poste pr Vallée-de-l'or","2017-05-28","2017-12-16","910","POLICIERS","04","AGENT CL 04","09","Agent","001","Patrouilleur","abs sagir (110)"]
["SQ13384","Roy","Julie-Anne",7434,"Poste pr Vallée-de-l'or","2017-12-17",null,"910","POLICIERS","04","AGENT CL 04","09","Agent","001","Patrouilleur"]
["SQ13392","Chamberland","Olivier",6854,"Poste pr Vallée-de-l'or","2014-06-24","2016-05-01","910","POLICIERS","04","AGENT CL 04","09","Agent","001","Patrouilleur"]
["SQ13392","Chamberland","Olivier",7434,"Poste pr Vallée-de-l'or","2016-05-02","2017-12-02","910","POLICIERS","04","AGENT CL 04","09","Agent","001","Patrouilleur"]
["SQ13392","Chamberland","Olivier",7434,"Poste pr Vallée-de-l'or","2017-12-03","2017-12-16","910","POLICIERS","04","AGENT CL 04","09","Agent","001","Patrouilleur","congé spécial (103)"]
["SQ13392","Chamberland","Olivier",7434,"Poste pr Vallée-de-l'or","2017-12-17","2017-12-30","910","POLICIERS","04","AGENT CL 04","09","Agent","001","Patrouilleur"]
["SQ13392","Chamberland","Olivier",7434,"Poste pr Vallée-de-l'or","2017-12-31","2018-01-20","910","POLICIERS","04","AGENT CL 04","09","Agent","001","Patrouilleur","congé spécial (103)"]
["SQ13392","Chamberland","Olivier",7434,"Poste pr Vallée-de-l'or","2018-01-21",null,"910","POLICIERS","04","AGENT CL 04","09","Agent","001","Patrouilleur"]
["SQ13430","Lapointe","Caroline",6854,"Poste pr Vallée-de-l'or","2011-02-14","2014-02-05","910","POLICIERS","07","AGENT SUR HOR. VAR.","09","Agent","407","Patr.Var. Ct"]
["SQ13430","Lapointe","Caroline",6854,"Poste pr Vallée-de-l'or","2014-02-06","2014-02-14","910","POLICIERS","07","AGENT SUR HOR. VAR.","09","Agent","400","Agt Sur Hor. Var."]
["SQ13430","Lapointe","Caroline",6854,"Poste pr Vallée-de-l'or","2014-02-15","2016-05-01","910","POLICIERS","04","AGENT CL 04","09","Agent","001","Patrouilleur"]
["SQ13430","Lapointe","Caroline",7434,"Poste pr Vallée-de-l'or","2016-05-02","2017-08-26","910","POLICIERS","04","AGENT CL 04","09","Agent","001","Patrouilleur"]
["SQ13430","Lapointe","Caroline",7434,"Poste pr Vallée-de-l'or","2017-08-27","2017-09-02","910","POLICIERS","04","AGENT CL 04","09","Agent","001","Patrouilleur","maternité (120)"]
["SQ13430","Lapointe","Caroline",7434,"Poste pr Vallée-de-l'or","2017-09-03","2017-09-14","910","POLICIERS","04","AGENT CL 04","09","Agent","001","Patrouilleur"]
["SQ13430","Lapointe","Caroline",7434,"Poste pr Vallée-de-l'or","2017-09-15","2018-01-31","910","POLICIERS","04","AGENT CL 04","09","Agent","001","Patrouilleur","maternité (120)"]
["SQ13430","Lapointe","Caroline",7434,"Poste pr Vallée-de-l'or","2018-02-01",null,"910","POLICIERS","04","AGENT CL 04","09","Agent","001","Patrouilleur","abs sagir (110)"]
["SQ13442","April","Francis",6854,"Poste pr Vallée-de-l'or","2011-02-14","2014-02-05","910","POLICIERS","07","AGENT SUR HOR. VAR.","09","Agent","407","Patr.Var. Ct"]
["SQ13442","April","Francis",6854,"Poste pr Vallée-de-l'or","2014-02-06","2014-10-09","910","POLICIERS","07","AGENT SUR HOR. VAR.","09","Agent","400","Agt Sur Hor. Var."]
["SQ13442","April","Francis",6854,"Poste pr Vallée-de-l'or","2014-10-10","2015-02-16","910","POLICIERS","04","AGENT CL 04","09","Agent","001","Patrouilleur"]
["SQ13447","Langlois","Emilie",6854,"Poste pr Vallée-de-l'or","2011-02-14","2014-02-05","910","POLICIERS","07","AGENT SUR HOR. VAR.","09","Agent","407","Patr.Var. Ct"]
["SQ13447","Langlois","Emilie",6854,"Poste pr Vallée-de-l'or","2014-02-06","2014-10-09","910","POLICIERS","07","AGENT SUR HOR. VAR.","09","Agent","400","Agt Sur Hor. Var."]
["SQ13447","Langlois","Emilie",6854,"Poste pr Vallée-de-l'or","2014-10-10","2015-02-16","910","POLICIERS","04","AGENT CL 04","09","Agent","001","Patrouilleur"]
["SQ13448","Charbonneau","Pierre-Luc",6854,"Poste pr Vallée-de-l'or","2011-02-14","2014-02-05","910","POLICIERS","07","AGENT SUR HOR. VAR.","09","Agent","407","Patr.Var. Ct"]
["SQ13448","Charbonneau","Pierre-Luc",6854,"Poste pr Vallée-de-l'or","2014-02-06","2014-09-09","910","POLICIERS","07","AGENT SUR HOR. VAR.","09","Agent","400","Agt Sur Hor. Var."]
["SQ13448","Charbonneau","Pierre-Luc",6854,"Poste pr Vallée-de-l'or","2014-09-10","2015-01-12","910","POLICIERS","04","AGENT CL 04","09","Agent","001","Patrouilleur"]
["SQ13484","Miron","Pier-Luc",6854,"Poste pr Vallée-de-l'or","2014-09-01","2016-05-01","910","POLICIERS","04","AGENT CL 04","09","Agent","001","Patrouilleur"]
["SQ13484","Miron","Pier-Luc",7434,"Poste pr Vallée-de-l'or","2016-05-02",null,"910","POLICIERS","04","AGENT CL 04","09","Agent","001","Patrouilleur"]
["SQ13544","Giguère-Asselin","Alexandre",6854,"Poste pr Vallée-de-l'or","2011-06-13","2014-06-12","910","POLICIERS","07","AGENT SUR HOR. VAR.","09","Agent","400","Agt Sur Hor. Var."]
["SQ13544","Giguère-Asselin","Alexandre",6854,"Poste pr Vallée-de-l'or","2014-06-13","2016-05-01","910","POLICIERS","04","AGENT CL 04","09","Agent","001","Patrouilleur"]
["SQ13544","Giguère-Asselin","Alexandre",7434,"Poste pr Vallée-de-l'or","2016-05-02",null,"910","POLICIERS","04","AGENT CL 04","09","Agent","001","Patrouilleur"]
["SQ13569","Bolduc","Mathieu",6854,"Poste pr Vallée-de-l'or","2011-09-26","2014-03-31","910","POLICIERS","07","AGENT SUR HOR. VAR.","09","Agent","400","Agt Sur Hor. Var."]
["SQ13597","Beaulieu","Michaël",6854,"Poste pr Vallée-de-l'or","2011-10-24","2014-10-24","910","POLICIERS","07","AGENT SUR HOR. VAR.","09","Agent","400","Agt Sur Hor. Var."]
["SQ13597","Beaulieu","Michaël",6854,"Poste pr Vallée-de-l'or","2014-10-25","2015-11-03","910","POLICIERS","04","AGENT CL 04","09","Agent","001","Patrouilleur"]
["SQ13597","Beaulieu","Michaël",6854,"Poste pr Vallée-de-l'or","2015-11-04","2016-05-01","910","POLICIERS","04","AGENT CL 04","09","Agent","001","Patrouilleur","assig. Admin. (130)"]
["SQ13597","Beaulieu","Michaël",7434,"Poste pr Vallée-de-l'or","2016-05-02","2016-05-03","910","POLICIERS","04","AGENT CL 04","09","Agent","001","Patrouilleur"]
["SQ13597","Beaulieu","Michaël",7434,"Poste pr Vallée-de-l'or","2016-05-04","2016-11-17","910","POLICIERS","04","AGENT CL 04","09","Agent","001","Patrouilleur","assig. Admin. (130)"]
["SQ13597","Beaulieu","Michaël",7434,"Poste pr Vallée-de-l'or","2016-11-18",null,"910","POLICIERS","04","AGENT CL 04","09","Agent","001","Patrouilleur"]
["SQ13672","Gévry","Cynthia",7434,"Poste pr Vallée-de-l'or","2016-07-19","2017-08-19","910","POLICIERS","04","AGENT CL 04","09","Agent","501","Patrouilleur"]
["SQ13672","Gévry","Cynthia",7434,"Poste pr Vallée-de-l'or","2017-08-20","2018-01-13","910","POLICIERS","04","AGENT CL 04","09","Agent","501","Patrouilleur"]
["SQ13748","Benoit","Tania",7434,"Poste pr Vallée-de-l'or","2016-07-24","2017-05-20","910","POLICIERS","04","AGENT CL 04","09","Agent","001","Patrouilleur"]
["SQ13748","Benoit","Tania",7434,"Poste pr Vallée-de-l'or","2017-05-21","2017-10-14","910","POLICIERS","04","AGENT CL 04","09","Agent","001","Patrouilleur","maternité (120)"]
["SQ13748","Benoit","Tania",7434,"Poste pr Vallée-de-l'or","2017-10-15",null,"910","POLICIERS","04","AGENT CL 04","09","Agent","001","Patrouilleur","abs sagir (110)"]
["SQ13789","Fortin","Mathieu",6854,"Poste pr Vallée-de-l'or","2012-05-28","2014-11-23","910","POLICIERS","07","AGENT SUR HOR. VAR.","09","Agent","400","Agt Sur Hor. Var."]
["SQ13807","Morin","Jason",6854,"Poste pr Vallée-de-l'or","2012-05-28","2013-11-11","910","POLICIERS","07","AGENT SUR HOR. VAR.","09","Agent","400","Agt Sur Hor. Var."]
["SQ13807","Morin","Jason",6854,"Poste pr Vallée-de-l'or","2013-11-12","2015-05-28","910","POLICIERS","07","AGENT SUR HOR. VAR.","09","Agent","400","Agt Sur Hor. Var."]
["SQ13807","Morin","Jason",6854,"Poste pr Vallée-de-l'or","2015-05-29","2015-09-14","910","POLICIERS","07","AGENT SUR HOR. VAR.","09","Agent","400","Agt Sur Hor. Var."]
["SQ13807","Morin","Jason",6854,"Poste pr Vallée-de-l'or","2015-09-15","2015-11-03","910","POLICIERS","04","AGENT CL 04","09","Agent","400","Agt Sur Hor. Var."]
["SQ13807","Morin","Jason",6854,"Poste pr Vallée-de-l'or","2015-11-04","2015-12-19","910","POLICIERS","04","AGENT CL 04","09","Agent","001","Patrouilleur"]
["SQ13807","Morin","Jason",6854,"Poste pr Vallée-de-l'or","2015-12-20","2016-01-09","910","POLICIERS","04","AGENT CL 04","09","Agent","001","Patrouilleur","congé spécial (103)"]
["SQ13807","Morin","Jason",6854,"Poste pr Vallée-de-l'or","2016-01-10","2016-05-01","910","POLICIERS","04","AGENT CL 04","09","Agent","001","Patrouilleur"]
["SQ13807","Morin","Jason",7434,"Poste pr Vallée-de-l'or","2016-05-02","2016-05-10","910","POLICIERS","04","AGENT CL 04","09","Agent","001","Patrouilleur"]
["SQ13807","Morin","Jason",7434,"Poste pr Vallée-de-l'or","2016-05-11","2016-07-16","910","POLICIERS","04","AGENT CL 04","09","Agent","001","Patrouilleur"]
["SQ13807","Morin","Jason",7434,"Poste pr Vallée-de-l'or","2016-07-17","2016-08-20","910","POLICIERS","04","AGENT CL 04","09","Agent","001","Patrouilleur","abs sagir (110)"]
["SQ13807","Morin","Jason",7434,"Poste pr Vallée-de-l'or","2016-08-21",null,"910","POLICIERS","04","AGENT CL 04","09","Agent","001","Patrouilleur"]
["SQ13808","Morency-Landry","Merlin",6854,"Poste pr Vallée-de-l'or","2016-03-22","2016-05-01","910","POLICIERS","04","AGENT CL 04","09","Agent","501","Patrouilleur"]
["SQ13808","Morency-Landry","Merlin",7434,"Poste pr Vallée-de-l'or","2016-05-02","2016-05-10","910","POLICIERS","04","AGENT CL 04","09","Agent","501","Patrouilleur"]
["SQ13808","Morency-Landry","Merlin",7434,"Poste pr Vallée-de-l'or","2016-05-11",null,"910","POLICIERS","04","AGENT CL 04","09","Agent","501","Patrouilleur"]
["SQ13830","Boisvert","Anne-Marie",6854,"Poste pr Vallée-de-l'or","2012-06-25","2013-11-11","910","POLICIERS","07","AGENT SUR HOR. VAR.","09","Agent","400","Agt Sur Hor. Var."]
["SQ13830","Boisvert","Anne-Marie",6854,"Poste pr Vallée-de-l'or","2013-11-12","2015-06-25","910","POLICIERS","07","AGENT SUR HOR. VAR.","09","Agent","400","Agt Sur Hor. Var."]
["SQ13830","Boisvert","Anne-Marie",6854,"Poste pr Vallée-de-l'or","2015-06-26","2015-09-14","910","POLICIERS","07","AGENT SUR HOR. VAR.","09","Agent","400","Agt Sur Hor. Var."]
["SQ13830","Boisvert","Anne-Marie",6854,"Poste pr Vallée-de-l'or","2015-09-15","2016-05-01","910","POLICIERS","04","AGENT CL 04","09","Agent","400","Agt Sur Hor. Var."]
["SQ13830","Boisvert","Anne-Marie",7434,"Poste pr Vallée-de-l'or","2016-05-02","2017-10-12","910","POLICIERS","04","AGENT CL 04","09","Agent","400","Agt Sur Hor. Var."]
["SQ13830","Boisvert","Anne-Marie",7434,"Poste pr Vallée-de-l'or","2017-10-13",null,"910","POLICIERS","04","AGENT CL 04","09","Agent","406","Patr.Var. (Rés.Dga)"]
["SQ13925","Bourassa","Kellie",6854,"Poste pr Vallée-de-l'or","2016-03-22","2016-05-01","910","POLICIERS","04","AGENT CL 04","09","Agent","501","Patrouilleur"]
["SQ13925","Bourassa","Kellie",7434,"Poste pr Vallée-de-l'or","2016-05-02",null,"910","POLICIERS","04","AGENT CL 04","09","Agent","501","Patrouilleur"]
["SQ13951","Baril","Maxim",6854,"Poste pr Vallée-de-l'or","2013-02-25","2014-02-05","910","POLICIERS","07","AGENT SUR HOR. VAR.","09","Agent","407","Patr.Var. Ct"]
["SQ13951","Baril","Maxim",6854,"Poste pr Vallée-de-l'or","2014-02-06","2016-02-25","910","POLICIERS","07","AGENT SUR HOR. VAR.","09","Agent","400","Agt Sur Hor. Var."]
["SQ13951","Baril","Maxim",6854,"Poste pr Vallée-de-l'or","2016-02-26","2016-05-01","910","POLICIERS","04","AGENT CL 04","09","Agent","501","Patrouilleur"]
["SQ13951","Baril","Maxim",7434,"Poste pr Vallée-de-l'or","2016-05-02",null,"910","POLICIERS","04","AGENT CL 04","09","Agent","501","Patrouilleur"]
["SQ13980","Gosselin","Alexandre",7434,"Poste pr Vallée-de-l'or","2016-09-20","2017-07-22","910","POLICIERS","04","AGENT CL 04","09","Agent","501","Patrouilleur"]
["SQ13980","Gosselin","Alexandre",7434,"Poste pr Vallée-de-l'or","2017-07-23","2017-08-05","910","POLICIERS","04","AGENT CL 04","09","Agent","501","Patrouilleur","congé spécial (103)"]
["SQ13980","Gosselin","Alexandre",7434,"Poste pr Vallée-de-l'or","2017-08-06","2017-09-13","910","POLICIERS","04","AGENT CL 04","09","Agent","501","Patrouilleur","abs sagir (110)"]
["SQ13980","Gosselin","Alexandre",7434,"Poste pr Vallée-de-l'or","2017-09-14",null,"910","POLICIERS","04","AGENT CL 04","09","Agent","501","Patrouilleur"]
["SQ13988","Lavoie","Audrey",6854,"Poste pr Vallée-de-l'or","2013-05-20","2016-05-01","910","POLICIERS","07","AGENT SUR HOR. VAR.","09","Agent","400","Agt Sur Hor. Var."]
["SQ13988","Lavoie","Audrey",7434,"Poste pr Vallée-de-l'or","2016-05-02","2016-05-20","910","POLICIERS","07","AGENT SUR HOR. VAR.","09","Agent","400","Agt Sur Hor. Var."]
["SQ13988","Lavoie","Audrey",7434,"Poste pr Vallée-de-l'or","2016-05-21","2017-04-26","910","POLICIERS","04","AGENT CL 04","09","Agent","400","Agt Sur Hor. Var."]
["SQ13988","Lavoie","Audrey",7434,"Poste pr Vallée-de-l'or","2017-04-27",null,"910","POLICIERS","04","AGENT CL 04","09","Agent","001","Patrouilleur"]
["SQ13998","Charpentier","Simon",7434,"Poste pr Vallée-de-l'or","2017-08-16",null,"910","POLICIERS","04","AGENT CL 04","09","Agent","001","Patrouilleur"]
["SQ14005","Chamberland","Mathieu",7434,"Poste pr Vallée-de-l'or","2016-11-01",null,"910","POLICIERS","04","AGENT CL 04","09","Agent","001","Patrouilleur"]
["SQ14031","Gascon-Langelier","Simon",7434,"Poste pr Vallée-de-l'or","2017-08-29",null,"910","POLICIERS","04","AGENT CL 04","09","Agent","001","Patrouilleur"]
["SQ14040","Leclerc","Eric",6854,"Poste pr Vallée-de-l'or","2014-03-24","2016-05-01","910","POLICIERS","07","AGENT SUR HOR. VAR.","09","Agent","400","Agt Sur Hor. Var."]
["SQ14040","Leclerc","Eric",7434,"Poste pr Vallée-de-l'or","2016-05-02","2017-03-23","910","POLICIERS","07","AGENT SUR HOR. VAR.","09","Agent","400","Agt Sur Hor. Var."]
["SQ14040","Leclerc","Eric",7434,"Poste pr Vallée-de-l'or","2017-03-24",null,"910","POLICIERS","04","AGENT CL 04","09","Agent","001","Patrouilleur"]
["SQ14058","Boutin","Simon",6854,"Poste pr Vallée-de-l'or","2014-03-24","2016-05-01","910","POLICIERS","07","AGENT SUR HOR. VAR.","09","Agent","400","Agt Sur Hor. Var."]
["SQ14058","Boutin","Simon",7434,"Poste pr Vallée-de-l'or","2016-05-02","2017-01-31","910","POLICIERS","07","AGENT SUR HOR. VAR.","09","Agent","400","Agt Sur Hor. Var."]
["SQ14061","Maurice","Maxime",7434,"Poste pr Vallée-de-l'or","2016-12-20","2017-02-09","910","POLICIERS","04","AGENT CL 04","09","Agent","501","Patrouilleur"]
["SQ14061","Maurice","Maxime",7434,"Poste pr Vallée-de-l'or","2017-02-10",null,"910","POLICIERS","04","AGENT CL 04","09","Agent","001","Patrouilleur"]
["SQ14087","Ouellet","Frédéric",6854,"Poste pr Vallée-de-l'or","2014-05-26","2016-05-01","910","POLICIERS","07","AGENT SUR HOR. VAR.","09","Agent","400","Agt Sur Hor. Var."]
["SQ14087","Ouellet","Frédéric",7434,"Poste pr Vallée-de-l'or","2016-05-02","2016-05-10","910","POLICIERS","07","AGENT SUR HOR. VAR.","09","Agent","400","Agt Sur Hor. Var."]
["SQ14087","Ouellet","Frédéric",7434,"Poste pr Vallée-de-l'or","2016-05-11","2016-08-12","910","POLICIERS","07","AGENT SUR HOR. VAR.","09","Agent","400","Agt Sur Hor. Var.","(2016-08-13 - démission)"]
["SQ14098","Bruneau","Alexandre",7434,"Poste pr Vallée-de-l'or","2017-09-05",null,"910","POLICIERS","04","AGENT CL 04","09","Agent","001","Patrouilleur"]
["SQ14100","Leblanc","Nicolas",7434,"Poste pr Vallée-de-l'or","2017-01-10",null,"910","POLICIERS","04","AGENT CL 04","09","Agent","001","Patrouilleur"]
["SQ14120","Savard","Mathieu",7434,"Poste pr Vallée-de-l'or","2017-07-18",null,"910","POLICIERS","04","AGENT CL 04","09","Agent","001","Patrouilleur"]
["SQ14165","Leblanc-Bilodeau","Patrice",6854,"Poste pr Vallée-de-l'or","2014-11-24","2016-05-01","910","POLICIERS","07","AGENT SUR HOR. VAR.","09","Agent","400","Agt Sur Hor. Var."]
["SQ14165","Leblanc-Bilodeau","Patrice",7434,"Poste pr Vallée-de-l'or","2016-05-02","2016-05-10","910","POLICIERS","07","AGENT SUR HOR. VAR.","09","Agent","400","Agt Sur Hor. Var."]
["SQ14165","Leblanc-Bilodeau","Patrice",7434,"Poste pr Vallée-de-l'or","2016-05-11","2017-06-30","910","POLICIERS","07","AGENT SUR HOR. VAR.","09","Agent","400","Agt Sur Hor. Var."]
["SQ14165","Leblanc-Bilodeau","Patrice",7434,"Poste pr Vallée-de-l'or","2017-07-01","2017-10-12","910","POLICIERS","04","AGENT CL 04","09","Agent","400","Agt Sur Hor. Var."]
["SQ14165","Leblanc-Bilodeau","Patrice",7434,"Poste pr Vallée-de-l'or","2017-10-13",null,"910","POLICIERS","04","AGENT CL 04","09","Agent","405","Patr. Var. (Rés.Comm"]
["SQ14180","Brousseau","Mylène",7434,"Poste pr Vallée-de-l'or","2016-12-20","2016-12-21","910","POLICIERS","04","AGENT CL 04","09","Agent","501","Patrouilleur"]
["SQ14180","Brousseau","Mylène",7434,"Poste pr Vallée-de-l'or","2017-05-01",null,"910","POLICIERS","04","AGENT CL 04","09","Agent","501","Patrouilleur"]
["SQ14231","Girard","Nicolas",6854,"Poste pr Vallée-de-l'or","2015-10-26","2016-05-01","910","POLICIERS","07","AGENT SUR HOR. VAR.","09","Agent","400","Agt Sur Hor. Var."]
["SQ14231","Girard","Nicolas",7434,"Poste pr Vallée-de-l'or","2016-05-02","2017-02-06","910","POLICIERS","07","AGENT SUR HOR. VAR.","09","Agent","400","Agt Sur Hor. Var."]
["SQ14234","Leclerc","François",6854,"Poste pr Vallée-de-l'or","2015-10-26","2016-05-01","910","POLICIERS","07","AGENT SUR HOR. VAR.","09","Agent","400","Agt Sur Hor. Var."]
["SQ14234","Leclerc","François",7434,"Poste pr Vallée-de-l'or","2016-05-02","2017-02-28","910","POLICIERS","07","AGENT SUR HOR. VAR.","09","Agent","400","Agt Sur Hor. Var."]
["SQ14244","Dostie","Samuel",6854,"Poste pr Vallée-de-l'or","2015-11-30","2016-05-01","910","POLICIERS","07","AGENT SUR HOR. VAR.","09","Agent","400","Agt Sur Hor. Var."]
["SQ14244","Dostie","Samuel",7434,"Poste pr Vallée-de-l'or","2016-05-02","2016-05-10","910","POLICIERS","07","AGENT SUR HOR. VAR.","09","Agent","400","Agt Sur Hor. Var."]
["SQ14244","Dostie","Samuel",7434,"Poste pr Vallée-de-l'or","2016-05-11","2017-03-31","910","POLICIERS","07","AGENT SUR HOR. VAR.","09","Agent","400","Agt Sur Hor. Var."]
["SQ14249","Huard","Yanick",6854,"Poste pr Vallée-de-l'or","2015-11-30","2016-05-01","910","POLICIERS","07","AGENT SUR HOR. VAR.","09","Agent","400","Agt Sur Hor. Var."]
["SQ14249","Huard","Yanick",7434,"Poste pr Vallée-de-l'or","2016-05-02","2016-05-10","910","POLICIERS","07","AGENT SUR HOR. VAR.","09","Agent","400","Agt Sur Hor. Var."]
["SQ14249","Huard","Yanick",7434,"Poste pr Vallée-de-l'or","2016-05-11","2016-06-18","910","POLICIERS","07","AGENT SUR HOR. VAR.","09","Agent","400","Agt Sur Hor. Var.","(2016-06-19 - démission)"]
["SQ14254","Dagenais","Justine",6854,"Poste pr Vallée-de-l'or","2015-11-30","2016-05-01","910","POLICIERS","07","AGENT SUR HOR. VAR.","09","Agent","400","Agt Sur Hor. Var."]
["SQ14254","Dagenais","Justine",7434,"Poste pr Vallée-de-l'or","2016-05-02","2016-05-10","910","POLICIERS","07","AGENT SUR HOR. VAR.","09","Agent","400","Agt Sur Hor. Var."]
["SQ14254","Dagenais","Justine",7434,"Poste pr Vallée-de-l'or","2016-05-11","2016-05-14","910","POLICIERS","07","AGENT SUR HOR. VAR.","09","Agent","400","Agt Sur Hor. Var.","(2016-05-14 - démission)"]
["SQ14255","Morin","Jeffrey",6854,"Poste pr Vallée-de-l'or","2015-11-30","2016-05-01","910","POLICIERS","07","AGENT SUR HOR. VAR.","09","Agent","400","Agt Sur Hor. Var."]
["SQ14255","Morin","Jeffrey",7434,"Poste pr Vallée-de-l'or","2016-05-02","2016-05-10","910","POLICIERS","07","AGENT SUR HOR. VAR.","09","Agent","400","Agt Sur Hor. Var."]
["SQ14255","Morin","Jeffrey",7434,"Poste pr Vallée-de-l'or","2016-05-11","2017-04-30","910","POLICIERS","07","AGENT SUR HOR. VAR.","09","Agent","400","Agt Sur Hor. Var."]
["SQ14256","Mercier","Rébécka",6854,"Poste pr Vallée-de-l'or","2015-11-30","2016-05-01","910","POLICIERS","07","AGENT SUR HOR. VAR.","09","Agent","400","Agt Sur Hor. Var."]
["SQ14256","Mercier","Rébécka",7434,"Poste pr Vallée-de-l'or","2016-05-02","2016-05-10","910","POLICIERS","07","AGENT SUR HOR. VAR.","09","Agent","400","Agt Sur Hor. Var."]
["SQ14256","Mercier","Rébécka",7434,"Poste pr Vallée-de-l'or","2016-05-11","2017-06-30","910","POLICIERS","07","AGENT SUR HOR. VAR.","09","Agent","400","Agt Sur Hor. Var."]
["SQ14256","Mercier","Rébécka",7434,"Poste pr Vallée-de-l'or","2017-07-01","2017-10-12","910","POLICIERS","04","AGENT CL 04","09","Agent","400","Agt Sur Hor. Var."]
["SQ14256","Mercier","Rébécka",7434,"Poste pr Vallée-de-l'or","2017-10-13",null,"910","POLICIERS","04","AGENT CL 04","09","Agent","405","Patr. Var. (Rés.Comm"]
["SQ14263","Larouche-Fortier","Sébastien",6854,"Poste pr Vallée-de-l'or","2016-03-14","2016-05-01","910","POLICIERS","07","AGENT SUR HOR. VAR.","09","Agent","400","Agt Sur Hor. Var."]
["SQ14263","Larouche-Fortier","Sébastien",7434,"Poste pr Vallée-de-l'or","2016-05-02","2017-06-30","910","POLICIERS","07","AGENT SUR HOR. VAR.","09","Agent","400","Agt Sur Hor. Var."]
["SQ14263","Larouche-Fortier","Sébastien",7434,"Poste pr Vallée-de-l'or","2017-07-01","2017-10-12","910","POLICIERS","04","AGENT CL 04","09","Agent","400","Agt Sur Hor. Var."]
["SQ14263","Larouche-Fortier","Sébastien",7434,"Poste pr Vallée-de-l'or","2017-10-13",null,"910","POLICIERS","04","AGENT CL 04","09","Agent","405","Patr. Var. (Rés.Comm"]
["SQ14308","Aumond","Roxanne",7434,"Poste pr Vallée-de-l'or","2016-05-23","2017-06-30","910","POLICIERS","07","AGENT SUR HOR. VAR.","09","Agent","400","Agt Sur Hor. Var."]
["SQ14308","Aumond","Roxanne",7434,"Poste pr Vallée-de-l'or","2017-07-01","2017-10-12","910","POLICIERS","04","AGENT CL 04","09","Agent","400","Agt Sur Hor. Var."]
["SQ14308","Aumond","Roxanne",7434,"Poste pr Vallée-de-l'or","2017-10-13",null,"910","POLICIERS","04","AGENT CL 04","09","Agent","405","Patr. Var. (Rés.Comm"]
["SQ14320","Dubé","Kevin",7434,"Poste pr Vallée-de-l'or","2016-05-23","2017-06-30","910","POLICIERS","07","AGENT SUR HOR. VAR.","09","Agent","400","Agt Sur Hor. Var."]
["SQ14320","Dubé","Kevin",7434,"Poste pr Vallée-de-l'or","2017-07-01","2017-10-12","910","POLICIERS","04","AGENT CL 04","09","Agent","400","Agt Sur Hor. Var."]
["SQ14320","Dubé","Kevin",7434,"Poste pr Vallée-de-l'or","2017-10-13",null,"910","POLICIERS","04","AGENT CL 04","09","Agent","405","Patr. Var. (Rés.Comm"]
["SQ14323","Fortin","Jean-Philip",7434,"Poste pr Vallée-de-l'or","2016-07-11","2017-06-30","910","POLICIERS","07","AGENT SUR HOR. VAR.","09","Agent","400","Agt Sur Hor. Var."]
["SQ14323","Fortin","Jean-Philip",7434,"Poste pr Vallée-de-l'or","2017-07-01","2017-10-12","910","POLICIERS","04","AGENT CL 04","09","Agent","400","Agt Sur Hor. Var."]
["SQ14323","Fortin","Jean-Philip",7434,"Poste pr Vallée-de-l'or","2017-10-13",null,"910","POLICIERS","04","AGENT CL 04","09","Agent","405","Patr. Var. (Rés.Comm"]
["SQ14324","Dallaire","Dominic",7434,"Poste pr Vallée-de-l'or","2016-07-11","2017-06-30","910","POLICIERS","07","AGENT SUR HOR. VAR.","09","Agent","400","Agt Sur Hor. Var."]
["SQ14324","Dallaire","Dominic",7434,"Poste pr Vallée-de-l'or","2017-07-01","2017-10-12","910","POLICIERS","04","AGENT CL 04","09","Agent","400","Agt Sur Hor. Var."]
["SQ14324","Dallaire","Dominic",7434,"Poste pr Vallée-de-l'or","2017-10-13",null,"910","POLICIERS","04","AGENT CL 04","09","Agent","405","Patr. Var. (Rés.Comm"]
["SQ14325","Legault","Anthony",6854,"Poste pr Vallée-de-l'or","2014-06-01","2014-08-06","910","POLICIERS","05","CADET","10","Cadet","395","Cadet-Étudiant"]
["SQ14325","Legault","Anthony",6854,"Poste pr Vallée-de-l'or","2014-08-07","2014-08-19","910","POLICIERS","05","CADET","10","Cadet","395","Cadet-Étudiant"]
["SQ14325","Legault","Anthony",7434,"Poste pr Vallée-de-l'or","2016-07-11","2017-06-30","910","POLICIERS","07","AGENT SUR HOR. VAR.","09","Agent","400","Agt Sur Hor. Var."]
["SQ14325","Legault","Anthony",7434,"Poste pr Vallée-de-l'or","2017-07-01","2017-10-12","910","POLICIERS","04","AGENT CL 04","09","Agent","400","Agt Sur Hor. Var."]
["SQ14325","Legault","Anthony",7434,"Poste pr Vallée-de-l'or","2017-10-13",null,"910","POLICIERS","04","AGENT CL 04","09","Agent","405","Patr. Var. (Rés.Comm"]
["SQ14332","Beaulieu","Samuel",6854,"Poste pr Vallée-de-l'or","2014-06-01","2014-08-06","910","POLICIERS","05","CADET","10","Cadet","395","Cadet-Étudiant"]
["SQ14332","Beaulieu","Samuel",6854,"Poste pr Vallée-de-l'or","2014-08-07","2014-08-19","910","POLICIERS","05","CADET","10","Cadet","395","Cadet-Étudiant"]
["SQ14439","Lapointe","Maxime",7434,"Poste pr Vallée-de-l'or","2017-05-15","2017-10-12","910","POLICIERS","04","AGENT CL 04","09","Agent","400","Agt Sur Hor. Var."]
["SQ14439","Lapointe","Maxime",7434,"Poste pr Vallée-de-l'or","2017-10-13",null,"910","POLICIERS","04","AGENT CL 04","09","Agent","405","Patr. Var. (Rés.Comm"]
["SQ14503","Guénard","Gabriel",7434,"Poste pr Vallée-de-l'or","2017-07-10","2017-10-12","910","POLICIERS","04","AGENT CL 04","09","Agent","400","Agt Sur Hor. Var."]
["SQ14503","Guénard","Gabriel",7434,"Poste pr Vallée-de-l'or","2017-10-13",null,"910","POLICIERS","04","AGENT CL 04","09","Agent","405","Patr. Var. (Rés.Comm"]
["SQ14516","Veillette","Marc-Antoine",7434,"Poste pr Vallée-de-l'or","2017-07-10","2017-10-12","910","POLICIERS","04","AGENT CL 04","09","Agent","400","Agt Sur Hor. Var."]
["SQ14516","Veillette","Marc-Antoine",7434,"Poste pr Vallée-de-l'or","2017-10-13",null,"910","POLICIERS","04","AGENT CL 04","09","Agent","405","Patr. Var. (Rés.Comm"]
["SQ14533","Pelchat","Jean-Philip",7434,"Poste pr Vallée-de-l'or","2017-10-09","2017-10-12","910","POLICIERS","04","AGENT CL 04","09","Agent","400","Agt Sur Hor. Var."]
["SQ14533","Pelchat","Jean-Philip",7434,"Poste pr Vallée-de-l'or","2017-10-13",null,"910","POLICIERS","04","AGENT CL 04","09","Agent","405","Patr. Var. (Rés.Comm"]
["SQ14537","Côté","Mélina",7434,"Poste pr Vallée-de-l'or","2017-10-09","2017-10-12","910","POLICIERS","04","AGENT CL 04","09","Agent","400","Agt Sur Hor. Var."]
["SQ14537","Côté","Mélina",7434,"Poste pr Vallée-de-l'or","2017-10-13",null,"910","POLICIERS","04","AGENT CL 04","09","Agent","405","Patr. Var. (Rés.Comm"]
["SQ30139","Brousseau","Jordan",6854,"Poste pr Vallée-de-l'or","2015-06-01","2015-08-21","910","POLICIERS","05","CADET","10","Cadet","395","Cadet-Étudiant"]
["SQ30156","Plouffe","Renaud",6854,"Poste pr Vallée-de-l'or","2015-06-01","2015-08-21","910","POLICIERS","05","CADET","10","Cadet","395","Cadet-Étudiant"]
["SQ30210","Gélineau","Maxim",7434,"Poste pr Vallée-de-l'or","2016-06-05","2016-08-23","910","POLICIERS","05","CADET","10","Cadet","395","Cadet-Étudiant"]
["SQ30210","Gélineau","Maxim",7434,"Poste pr Vallée-de-l'or","2016-08-24","2016-08-31","910","POLICIERS","05","CADET","10","Cadet","395","Cadet-Étudiant"]
["SQ30210","Gélineau","Maxim",7434,"Poste pr Vallée-de-l'or","2016-09-01","2016-09-04","910","POLICIERS","05","CADET","10","Cadet","395","Cadet-Étudiant"]
["SQ30210","Gélineau","Maxim",7434,"Poste pr Vallée-de-l'or","2017-06-04","2017-08-23","910","POLICIERS","05","CADET","10","Cadet","395","Cadet-Étudiant"]
["SQ30215","Roch","Antoine",7434,"Poste pr Vallée-de-l'or","2016-06-05","2016-08-23","910","POLICIERS","05","CADET","10","Cadet","395","Cadet-Étudiant"]
["SQ30215","Roch","Antoine",7434,"Poste pr Vallée-de-l'or","2016-08-24","2016-08-31","910","POLICIERS","05","CADET","10","Cadet","395","Cadet-Étudiant"]
["SQ30215","Roch","Antoine",7434,"Poste pr Vallée-de-l'or","2016-09-01","2016-09-04","910","POLICIERS","05","CADET","10","Cadet","395","Cadet-Étudiant"]
["SQ30215","Roch","Antoine",7434,"Poste pr Vallée-de-l'or","2017-06-04","2017-08-23","910","POLICIERS","05","CADET","10","Cadet","395","Cadet-Étudiant"]
["SQ7317","Tremblay","Jacques",6854,"Poste pr Vallée-de-l'or","2003-05-09","2006-08-31","910","POLICIERS","22","SERGENT CL 22","07","Sergent","112","Resp D'Équipe"]
["SQ7317","Tremblay","Jacques",6854,"Poste pr Vallée-de-l'or","2006-09-01","2010-11-18","910","POLICIERS","32","SERGENT CL 32","07","Sergent","112","Resp D'Équipe"]
["SQ7317","Tremblay","Jacques",6854,"Poste pr Vallée-de-l'or","2010-11-19","2011-11-29","910","POLICIERS","32","SERGENT CL 32","07","Sergent","112","Resp D'Équipe"]
["SQ7317","Tremblay","Jacques",6854,"Poste pr Vallée-de-l'or","2011-11-30","2013-01-03","910","POLICIERS","22","SERGENT CL 22","07","Sergent","112","Resp D'Équipe"]
["SQ7317","Tremblay","Jacques",6854,"Poste pr Vallée-de-l'or","2013-01-04","2014-03-02","910","POLICIERS","22","SERGENT CL 22","07","Sergent","163","Adj Enquêtes      50","prêt"]
["SQ7317","Tremblay","Jacques",6854,"Poste pr Vallée-de-l'or","2014-03-03","2015-04-29","910","POLICIERS","22","SERGENT CL 22","07","Sergent","112","Resp D'Équipe"]
["SQ7674","Cloutier","Mario",6831,"Esc rég enquêtes Val-d'Or","2004-08-07","2010-03-31","910","POLICIERS","12","SERGENT CL 12","07","Sergent","047","Agt de liaison"]
["SQ7674","Cloutier","Mario",4175,"Éq enq région Val d'Or","2010-04-11","2012-06-13","910","POLICIERS","12","SERGENT CL 12","07","Sergent","047","Agt de liaison"]
["SQ7674","Cloutier","Mario",8113,"Éq rens crim Val d'Or","2012-06-14","2012-10-31","910","POLICIERS","12","SERGENT CL 12","07","Sergent","047","Agt de liaison"]
["SQ7674","Cloutier","Mario",8030,"Éq enq région Val d'Or","2012-11-01","2013-02-28","910","POLICIERS","12","SERGENT CL 12","07","Sergent","004","Enquêteur","prêt"]
["SQ7674","Cloutier","Mario",8425,"Éq enq région Val d'Or","2013-03-01","2013-03-02","910","POLICIERS","12","SERGENT CL 12","07","Sergent","004","Enquêteur","prêt"]
["SQ7674","Cloutier","Mario",8425,"Éq enq région Val d'Or","2013-03-03","2013-04-24","910","POLICIERS","12","SERGENT CL 12","07","Sergent","004","Enquêteur","prêt"]
["SQ7674","Cloutier","Mario",8425,"Éq enq région Val d'Or","2013-04-25","2013-04-26","910","POLICIERS","12","SERGENT CL 12","07","Sergent","004","Enquêteur","prêt"]
["SQ7674","Cloutier","Mario",8425,"Éq enq région Val d'Or","2013-04-27","2014-07-10","910","POLICIERS","12","SERGENT CL 12","07","Sergent","004","Enquêteur","prêt"]
["SQ7674","Cloutier","Mario",8425,"Éq enq région Val d'Or","2014-07-11","2015-12-27","910","POLICIERS","12","SERGENT CL 12","07","Sergent","004","Enquêteur"]
["SQ7674","Cloutier","Mario",8425,"Éq enq région Val d'Or","2015-12-28","2016-11-13","910","POLICIERS","12","SERGENT CL 12","07","Sergent","004","Enquêteur","acc.trav.retr.preventif (102)"]
["SQ7674","Cloutier","Mario",8670,"Éq enq cr maj Val d'Or","2016-11-14",null,"910","POLICIERS","12","SERGENT CL 12","07","Sergent","004","Enquêteur","acc.trav.retr.preventif (102)"]
["SQ8086","Fleurent","Daniel",6854,"Poste pr Vallée-de-l'or","2005-03-04","2007-07-22","910","POLICIERS","04","AGENT CL 04","09","Agent","001","Patrouilleur"]
["SQ8086","Fleurent","Daniel",6854,"Poste pr Vallée-de-l'or","2007-07-23","2007-12-19","910","POLICIERS","04","AGENT CL 04","09","Agent","113","Superv De Relève","prêt"]
["SQ8086","Fleurent","Daniel",6854,"Poste pr Vallée-de-l'or","2007-12-20","2008-01-17","910","POLICIERS","04","AGENT CL 04","09","Agent","001","Patrouilleur"]
["SQ8086","Fleurent","Daniel",6854,"Poste pr Vallée-de-l'or","2008-01-18","2010-11-18","910","POLICIERS","12","SERGENT CL 12","07","Sergent","113","Superv De Relève"]
["SQ8086","Fleurent","Daniel",6854,"Poste pr Vallée-de-l'or","2010-11-19","2012-06-11","910","POLICIERS","12","SERGENT CL 12","07","Sergent","113","Superv De Relève"]
["SQ8593","Trottier","Réjean",6854,"Poste pr Vallée-de-l'or","2005-01-17","2007-03-21","909","OFFICIERS","04","CAPITAINE","05","Capitaine","090","Directeur"]
["SQ8593","Trottier","Réjean",6854,"Poste pr Vallée-de-l'or","2007-03-22","2007-04-30","909","OFFICIERS","03","INSPECTEUR","04","Inspecteur","090","Directeur"]
["SQ8593","Trottier","Réjean",6854,"Poste pr Vallée-de-l'or","2007-07-05","2007-07-05","909","OFFICIERS","03","INSPECTEUR","04","Inspecteur","090","Directeur"]
["SQ8623","Cantin","Michel",6854,"Poste pr Vallée-de-l'or","2004-05-17","2005-02-06","910","POLICIERS","12","SERGENT CL 12","07","Sergent","074","Adj Resp Poste    50","prêt"]
["SQ8623","Cantin","Michel",6854,"Poste pr Vallée-de-l'or","2005-02-07","2007-08-05","910","POLICIERS","12","SERGENT CL 12","07","Sergent","113","Superv De Relève"]
["SQ8623","Cantin","Michel",6854,"Poste pr Vallée-de-l'or","2008-02-05","2008-02-05","910","POLICIERS","12","SERGENT CL 12","07","Sergent","113","Superv De Relève"]
["SQ8623","Cantin","Michel",6854,"Poste pr Vallée-de-l'or","2008-03-08","2008-06-01","910","POLICIERS","12","SERGENT CL 12","07","Sergent","113","Superv De Relève"]
["SQ8644","Boutin","Carole",6854,"Poste pr Vallée-de-l'or","2002-06-27","2005-07-24","910","POLICIERS","12","SERGENT CL 12","07","Sergent","113","Superv De Relève"]
["SQ8663","Landry","Jean",6854,"Poste pr Vallée-de-l'or","2015-11-10","2015-12-12","910","POLICIERS","12","SERGENT CL 12","07","Sergent","032","Agt Liais. Autoch 02"]
["SQ8717","Marcotte","Richard",6854,"Poste pr Vallée-de-l'or","2002-06-27","2006-08-31","910","POLICIERS","34","AGENT CL 34","09","Agent","003","Enquêteur Poste   50"]
["SQ8717","Marcotte","Richard",6854,"Poste pr Vallée-de-l'or","2006-09-01","2010-11-18","910","POLICIERS","12","SERGENT CL 12","07","Sergent","003","Enquêteur Poste   50"]
["SQ8717","Marcotte","Richard",6854,"Poste pr Vallée-de-l'or","2010-11-19","2015-06-19","910","POLICIERS","12","SERGENT CL 12","07","Sergent","003","Enquêteur Poste   50"]
["SQ8717","Marcotte","Richard",6854,"Poste pr Vallée-de-l'or","2015-06-20","2016-05-01","910","POLICIERS","22","SERGENT CL 22","07","Sergent","112","Resp D'Équipe"]
["SQ8717","Marcotte","Richard",7434,"Poste pr Vallée-de-l'or","2016-05-02","2016-08-18","910","POLICIERS","22","SERGENT CL 22","07","Sergent","112","Resp D'Équipe"]
["SQ8717","Marcotte","Richard",7434,"Poste pr Vallée-de-l'or","2016-08-19","2016-11-07","910","POLICIERS","22","SERGENT CL 22","07","Sergent","112","Resp D'Équipe","assig. Admin. (130)"]
["SQ8717","Marcotte","Richard",7434,"Poste pr Vallée-de-l'or","2016-11-08","2016-11-13","910","POLICIERS","22","SERGENT CL 22","07","Sergent","112","Resp D'Équipe"]
["SQ8717","Marcotte","Richard",8676,"Éq enq MRC Vallée-de-l'Or","2016-11-14","2018-01-31","910","POLICIERS","22","SERGENT CL 22","07","Sergent","112","Resp D'Équipe","MSO"]
["SQ8889","Séguin","Ginette",6854,"Poste pr Vallée-de-l'or","2015-10-26","2016-01-20","909","OFFICIERS","43","CAPITAINE","05","Capitaine","090","Directeur"]
["SQ8930","Simoneau","Sylvie",6854,"Poste pr Vallée-de-l'or","2004-05-03","2010-11-18","910","POLICIERS","12","SERGENT CL 12","07","Sergent","034","Agent Rel Communaut"]
["SQ8930","Simoneau","Sylvie",6854,"Poste pr Vallée-de-l'or","2010-11-19","2016-05-01","910","POLICIERS","12","SERGENT CL 12","07","Sergent","034","Agent Rel Communaut"]
["SQ8930","Simoneau","Sylvie",7434,"Poste pr Vallée-de-l'or","2016-05-02","2016-05-23","910","POLICIERS","12","SERGENT CL 12","07","Sergent","034","Agent Rel Communaut"]
["SQ8930","Simoneau","Sylvie",7434,"Poste pr Vallée-de-l'or","2016-05-24","2016-08-09","910","POLICIERS","12","SERGENT CL 12","07","Sergent","032","Agt Liais. Autoch 02"]
["SQ8930","Simoneau","Sylvie",8209,"Éq liaison autoch Val d'Or","2016-08-10","2017-03-21","910","POLICIERS","12","SERGENT CL 12","07","Sergent","032","Agt Liais. Autoch 02"]
["SQ8942","Coutu","Benoît",6854,"Poste pr Vallée-de-l'or","2002-06-27","2007-03-13","910","POLICIERS","12","SERGENT CL 12","07","Sergent","113","Superv De Relève"]
["SQ8942","Coutu","Benoît",6854,"Poste pr Vallée-de-l'or","2007-03-14","2007-09-13","910","POLICIERS","12","SERGENT CL 12","07","Sergent","074","Adj Resp Poste    50","prêt"]
["SQ8942","Coutu","Benoît",6854,"Poste pr Vallée-de-l'or","2007-09-14","2007-09-14","910","POLICIERS","12","SERGENT CL 12","07","Sergent","113","Superv De Relève"]
["SQ8942","Coutu","Benoît",6854,"Poste pr Vallée-de-l'or","2007-09-15","2007-11-04","910","POLICIERS","05","CADET","07","Sergent","125","Directeur Adjoint","prêt"]
["SQ8942","Coutu","Benoît",6854,"Poste pr Vallée-de-l'or","2007-11-05","2008-05-11","910","POLICIERS","12","SERGENT CL 12","07","Sergent","113","Superv De Relève"]
["SQ8942","Coutu","Benoît",6854,"Poste pr Vallée-de-l'or","2008-05-12","2008-11-14","910","POLICIERS","12","SERGENT CL 12","07","Sergent","003","Enquêteur Poste   50","prêt"]
["SQ8942","Coutu","Benoît",6854,"Poste pr Vallée-de-l'or","2008-11-15","2009-06-23","910","POLICIERS","12","SERGENT CL 12","07","Sergent","113","Superv De Relève"]
["SQ8942","Coutu","Benoît",6854,"Poste pr Vallée-de-l'or","2009-06-24","2010-01-03","910","POLICIERS","12","SERGENT CL 12","07","Sergent","034","Agent Rel Communaut","prêt"]
["SQ8942","Coutu","Benoît",6854,"Poste pr Vallée-de-l'or","2010-01-04","2010-01-04","910","POLICIERS","12","SERGENT CL 12","07","Sergent","113","Superv De Relève"]
["SQ8942","Coutu","Benoît",6854,"Poste pr Vallée-de-l'or","2010-01-05","2010-04-29","910","POLICIERS","12","SERGENT CL 12","07","Sergent","003","Enquêteur Poste   50","prêt"]
["SQ8942","Coutu","Benoît",6854,"Poste pr Vallée-de-l'or","2010-04-30","2010-09-14","910","POLICIERS","12","SERGENT CL 12","07","Sergent","113","Superv De Relève"]
["SQ9165","Dussault","Yanick",6854,"Poste pr Vallée-de-l'or","2004-09-01","2005-09-26","909","OFFICIERS","05","LIEUTENANT","06","Lieutenant","163","Adj Enquêtes      50"]
["SQ9165","Dussault","Yanick",6854,"Poste pr Vallée-de-l'or","2005-09-27","2006-03-30","909","OFFICIERS","05","LIEUTENANT","06","Lieutenant","074","Adj Resp Poste    50"]
["SQ9165","Dussault","Yanick",6854,"Poste pr Vallée-de-l'or","2006-03-31","2006-03-31","909","OFFICIERS","05","LIEUTENANT","06","Lieutenant","163","Adj Enquêtes      50"]
["SQ9165","Dussault","Yanick",6854,"Poste pr Vallée-de-l'or","2006-04-01","2006-07-30","909","OFFICIERS","05","LIEUTENANT","06","Lieutenant","125","Directeur Adjoint"]
["SQ9165","Dussault","Yanick",6854,"Poste pr Vallée-de-l'or","2006-07-31","2006-09-04","909","OFFICIERS","05","LIEUTENANT","06","Lieutenant","163","Adj Enquêtes      50"]
["SQ9165","Dussault","Yanick",6854,"Poste pr Vallée-de-l'or","2006-09-05","2007-03-13","909","OFFICIERS","05","LIEUTENANT","06","Lieutenant","074","Adj Resp Poste    50"]
["SQ9165","Dussault","Yanick",6854,"Poste pr Vallée-de-l'or","2007-03-14","2007-06-20","909","OFFICIERS","05","LIEUTENANT","06","Lieutenant","090","Directeur"]
["SQ9165","Dussault","Yanick",6854,"Poste pr Vallée-de-l'or","2007-06-21","2007-06-21","909","OFFICIERS","05","LIEUTENANT","06","Lieutenant","074","Adj Resp Poste    50"]
["SQ9165","Dussault","Yanick",6854,"Poste pr Vallée-de-l'or","2007-06-22","2010-07-04","909","OFFICIERS","04","CAPITAINE","05","Capitaine","090","Directeur"]
["SQ9196","Harvey","Marielle",6831,"Esc rég enquêtes Val-d'Or","2008-03-28","2010-03-31","910","POLICIERS","22","SERGENT CL 22","07","Sergent","112","Resp D'Équipe"]
["SQ9196","Harvey","Marielle",4175,"Éq enq région Val d'Or","2010-04-01","2010-11-18","910","POLICIERS","22","SERGENT CL 22","07","Sergent","112","Resp D'Équipe"]
["SQ9196","Harvey","Marielle",4175,"Éq enq région Val d'Or","2010-11-19","2011-11-29","910","POLICIERS","22","SERGENT CL 22","07","Sergent","112","Resp D'Équipe"]
["SQ9196","Harvey","Marielle",4175,"Éq enq région Val d'Or","2011-11-30","2012-06-13","910","POLICIERS","22","SERGENT CL 22","07","Sergent","112","Resp D'Équipe"]
["SQ9196","Harvey","Marielle",8030,"Éq enq région Val d'Or","2012-06-14","2013-02-28","910","POLICIERS","22","SERGENT CL 22","07","Sergent","112","Resp D'Équipe"]
["SQ9196","Harvey","Marielle",8425,"Éq enq région Val d'Or","2013-03-01","2013-05-31","910","POLICIERS","22","SERGENT CL 22","07","Sergent","112","Resp D'Équipe"]
["SQ9196","Harvey","Marielle",8425,"Éq enq région Val d'Or","2013-06-01","2013-11-30","910","POLICIERS","22","SERGENT CL 22","07","Sergent","112","Resp D'Équipe","abs sagir (110)"]
["SQ9196","Harvey","Marielle",8425,"Éq enq région Val d'Or","2013-12-01","2014-03-02","910","POLICIERS","22","SERGENT CL 22","07","Sergent","112","Resp D'Équipe"]
["SQ9196","Harvey","Marielle",6854,"Poste pr Vallée-de-l'or","2014-03-03","2016-02-28","910","POLICIERS","22","SERGENT CL 22","07","Sergent","163","Adj Enquêtes      50","prêt"]
["SQ9196","Harvey","Marielle",6854,"Poste pr Vallée-de-l'or","2016-02-29","2016-05-01","909","OFFICIERS","53","LIEUTENANT","06","Lieutenant","163","Adj Enquêtes      50"]
["SQ9196","Harvey","Marielle",7434,"Poste pr Vallée-de-l'or","2016-05-02","2016-11-13","909","OFFICIERS","53","LIEUTENANT","06","Lieutenant","163","Adj Enquêtes      50"]
["SQ9196","Harvey","Marielle",4129,"Div enq MRC ATNQ Val d'Or","2016-11-14","","909","OFFICIERS","53","LIEUTENANT","06","Lieutenant","093","Resp Division"]
["SQ9290","Corriveau","Ghislain",7434,"Poste pr Vallée-de-l'or","2016-05-02",null,"910","POLICIERS","04","AGENT CL 04","09","Agent","501","Patrouilleur"]
["SQ9321","Rail","Danny",6432,"CSMRC Val d'Or","2017-01-02","2017-04-24","909","OFFICIERS","43","CAPITAINE","05","Capitaine","090","Directeur"]
["SQ9418","Caouette","Éric",6831,"Esc rég enquêtes Val-d'Or","2003-12-01","2009-12-12","910","POLICIERS","12","SERGENT CL 12","07","Sergent","004","Enquêteur"]
["SQ9418","Caouette","Éric",6831,"Esc rég enquêtes Val-d'Or","2009-12-13","2010-01-01","910","POLICIERS","12","SERGENT CL 12","07","Sergent","004","Enquêteur","congé sans solde paternité (121)"]
["SQ9418","Caouette","Éric",6831,"Esc rég enquêtes Val-d'Or","2010-01-02","2010-03-31","910","POLICIERS","12","SERGENT CL 12","07","Sergent","004","Enquêteur"]
["SQ9418","Caouette","Éric",4175,"Éq enq région Val d'Or","2010-04-01","2010-07-17","910","POLICIERS","12","SERGENT CL 12","07","Sergent","004","Enquêteur"]
["SQ9418","Caouette","Éric",4175,"Éq enq région Val d'Or","2010-07-18","2010-07-31","910","POLICIERS","12","SERGENT CL 12","07","Sergent","004","Enquêteur","congé sans solde paternité (121)"]
["SQ9418","Caouette","Éric",4175,"Éq enq région Val d'Or","2010-08-01","2012-06-13","910","POLICIERS","12","SERGENT CL 12","07","Sergent","004","Enquêteur"]
["SQ9418","Caouette","Éric",8030,"Éq enq région Val d'Or","2012-06-14","2013-02-28","910","POLICIERS","12","SERGENT CL 12","07","Sergent","004","Enquêteur"]
["SQ9418","Caouette","Éric",8425,"Éq enq région Val d'Or","2013-03-01","2013-05-31","910","POLICIERS","12","SERGENT CL 12","07","Sergent","004","Enquêteur"]
["SQ9418","Caouette","Éric",8425,"Éq enq région Val d'Or","2013-06-01","2013-12-01","910","POLICIERS","12","SERGENT CL 12","07","Sergent","112","Resp D'Équipe","prêt"]
["SQ9418","Caouette","Éric",8425,"Éq enq région Val d'Or","2013-12-02","2014-03-02","910","POLICIERS","12","SERGENT CL 12","07","Sergent","004","Enquêteur"]
["SQ9418","Caouette","Éric",8425,"Éq enq région Val d'Or","2014-03-03","2014-05-06","910","POLICIERS","12","SERGENT CL 12","07","Sergent","112","Resp D'Équipe","prêt"]
["SQ9418","Caouette","Éric",8425,"Éq enq région Val d'Or","2014-05-07","2016-06-14","910","POLICIERS","22","SERGENT CL 22","07","Sergent","112","Resp D'Équipe"]
["SQ9458","Routhier","Michel",6854,"Poste pr Vallée-de-l'or","1999-04-12","2008-05-11","910","POLICIERS","04","AGENT CL 04","09","Agent","001","Patrouilleur"]
["SQ9458","Routhier","Michel",6854,"Poste pr Vallée-de-l'or","2008-05-12","2009-04-03","910","POLICIERS","04","AGENT CL 04","09","Agent","113","Superv De Relève","prêt"]
["SQ9458","Routhier","Michel",6854,"Poste pr Vallée-de-l'or","2009-04-04","2010-11-18","910","POLICIERS","04","AGENT CL 04","09","Agent","001","Patrouilleur"]
["SQ9458","Routhier","Michel",6854,"Poste pr Vallée-de-l'or","2010-11-19","2012-01-08","910","POLICIERS","04","AGENT CL 04","09","Agent","001","Patrouilleur"]
["SQ9458","Routhier","Michel",6854,"Poste pr Vallée-de-l'or","2012-01-09","2012-06-22","910","POLICIERS","04","AGENT CL 04","09","Agent","003","Enquêteur Poste   50","prêt"]
["SQ9458","Routhier","Michel",6854,"Poste pr Vallée-de-l'or","2012-06-23","2013-01-01","910","POLICIERS","04","AGENT CL 04","09","Agent","113","Superv De Relève","prêt"]
["SQ9458","Routhier","Michel",6854,"Poste pr Vallée-de-l'or","2013-01-02","2013-01-03","910","POLICIERS","04","AGENT CL 04","09","Agent","001","Patrouilleur"]
["SQ9458","Routhier","Michel",6854,"Poste pr Vallée-de-l'or","2013-01-04","2014-03-30","910","POLICIERS","04","AGENT CL 04","09","Agent","003","Enquêteur Poste   50","prêt"]
["SQ9458","Routhier","Michel",6854,"Poste pr Vallée-de-l'or","2014-03-31","2014-07-14","910","POLICIERS","04","AGENT CL 04","09","Agent","003","Enquêteur Poste   50","prêt"]
["SQ9458","Routhier","Michel",6854,"Poste pr Vallée-de-l'or","2014-07-15","2016-05-01","910","POLICIERS","12","SERGENT CL 12","07","Sergent","003","Enquêteur Poste   50"]
["SQ9458","Routhier","Michel",7434,"Poste pr Vallée-de-l'or","2016-05-02","2016-11-13","910","POLICIERS","12","SERGENT CL 12","07","Sergent","003","Enquêteur Poste   50"]
["SQ9458","Routhier","Michel",8676,"Éq enq MRC Vallée-de-l'Or","2016-11-14",null,"910","POLICIERS","12","SERGENT CL 12","07","Sergent","003","Enquêteur Poste   50","MSO"]
["SQ9471","Robert","Marc",6432,"CSMRC Val d'Or","2017-06-05","2017-06-19","909","OFFICIERS","53","LIEUTENANT","06","Lieutenant","090","Directeur"]
["SQ9471","Robert","Marc",6432,"CSMRC Val d'Or","2017-06-20","2017-09-25","909","OFFICIERS","43","CAPITAINE","05","Capitaine","090","Directeur"]
["SQ9471","Robert","Marc",6432,"CSMRC Val d'Or","2017-09-26","","909","OFFICIERS","43","CAPITAINE","05","Capitaine","090","Directeur"]
["SQ9523","Paul","Christian",6854,"Poste pr Vallée-de-l'or","2007-09-17","2010-01-17","910","POLICIERS","12","SERGENT CL 12","07","Sergent","113","Superv De Relève"]
["SQ9523","Paul","Christian",6854,"Poste pr Vallée-de-l'or","2010-03-14","2010-06-17","910","POLICIERS","12","SERGENT CL 12","07","Sergent","113","Superv De Relève"]
["SQ9523","Paul","Christian",6854,"Poste pr Vallée-de-l'or","2010-06-18","2010-11-18","910","POLICIERS","05","CADET","07","Sergent","074","Adj Resp Poste    50","prêt"]
["SQ9523","Paul","Christian",6854,"Poste pr Vallée-de-l'or","2010-11-19","2011-07-03","910","POLICIERS","12","SERGENT CL 12","07","Sergent","074","Adj Resp Poste    50","prêt"]
["SQ9523","Paul","Christian",6854,"Poste pr Vallée-de-l'or","2011-07-04","2011-07-05","910","POLICIERS","12","SERGENT CL 12","07","Sergent","113","Superv De Relève"]
["SQ9523","Paul","Christian",6854,"Poste pr Vallée-de-l'or","2011-07-06","2011-09-09","910","POLICIERS","12","SERGENT CL 12","07","Sergent","074","Adj Resp Poste    50","prêt"]
["SQ9523","Paul","Christian",6854,"Poste pr Vallée-de-l'or","2011-09-10","2011-09-18","910","POLICIERS","12","SERGENT CL 12","07","Sergent","113","Superv De Relève"]
["SQ9523","Paul","Christian",6854,"Poste pr Vallée-de-l'or","2013-08-26","2015-08-30","910","POLICIERS","12","SERGENT CL 12","07","Sergent","113","Superv De Relève"]
["SQ9530","Dumontier","Martin",6854,"Poste pr Vallée-de-l'or","1999-09-13","2005-05-08","910","POLICIERS","04","AGENT CL 04","09","Agent","001","Patrouilleur"]
["SQ9558","Veillette","David",6854,"Poste pr Vallée-de-l'or","2002-11-01","2008-02-06","910","POLICIERS","04","AGENT CL 04","09","Agent","001","Patrouilleur"]
["SQ9558","Veillette","David",6854,"Poste pr Vallée-de-l'or","2008-02-07","2009-12-01","910","POLICIERS","04","AGENT CL 04","09","Agent","113","Superv De Relève","prêt"]
["SQ9558","Veillette","David",6854,"Poste pr Vallée-de-l'or","2009-12-02","2010-11-18","910","POLICIERS","04","AGENT CL 04","09","Agent","001","Patrouilleur"]
["SQ9558","Veillette","David",6854,"Poste pr Vallée-de-l'or","2010-11-19","2011-09-02","910","POLICIERS","04","AGENT CL 04","09","Agent","113","Superv De Relève","prêt"]
["SQ9558","Veillette","David",6854,"Poste pr Vallée-de-l'or","2011-09-03","2012-10-16","910","POLICIERS","04","AGENT CL 04","09","Agent","001","Patrouilleur"]
["SQ9558","Veillette","David",6854,"Poste pr Vallée-de-l'or","2012-10-17","2012-10-20","910","POLICIERS","12","SERGENT CL 12","07","Sergent","113","Superv De Relève"]
["SQ9558","Veillette","David",6854,"Poste pr Vallée-de-l'or","2012-10-21","2013-02-14","910","POLICIERS","04","AGENT CL 04","09","Agent","113","Superv De Relève"]
["SQ9558","Veillette","David",6854,"Poste pr Vallée-de-l'or","2013-02-15","2016-05-01","910","POLICIERS","12","SERGENT CL 12","07","Sergent","113","Superv De Relève"]
["SQ9558","Veillette","David",7434,"Poste pr Vallée-de-l'or","2016-05-02","2016-11-13","910","POLICIERS","12","SERGENT CL 12","07","Sergent","113","Superv De Relève"]
["SQ9558","Veillette","David",8676,"Éq enq MRC Vallée-de-l'Or","2016-11-14","2016-12-17","910","POLICIERS","12","SERGENT CL 12","07","Sergent","003","Enquêteur Poste   50","prêt"]
["SQ9558","Veillette","David",7434,"Poste pr Vallée-de-l'or","2016-12-18","2017-01-08","910","POLICIERS","12","SERGENT CL 12","07","Sergent","113","Superv De Relève"]
["SQ9558","Veillette","David",8676,"Éq enq MRC Vallée-de-l'Or","2017-01-09","2017-11-18","910","POLICIERS","12","SERGENT CL 12","07","Sergent","003","Enquêteur Poste   50","prêt"]
["SQ9558","Veillette","David",7434,"Poste pr Vallée-de-l'or","2017-11-19",null,"910","POLICIERS","12","SERGENT CL 12","07","Sergent","113","Superv De Relève"]
["SQ9616","Paiement","Mathieu",6854,"Poste pr Vallée-de-l'or","2000-06-26","2005-05-31","910","POLICIERS","04","AGENT CL 04","09","Agent","001","Patrouilleur"]
["SQ9678","Simard","Myriam",6854,"Poste pr Vallée-de-l'or","2002-04-02","2006-07-27","910","POLICIERS","04","AGENT CL 04","09","Agent","001","Patrouilleur"]
["SQ9857","Garneau","Stéphane",6854,"Poste pr Vallée-de-l'or","2008-11-16","2008-12-19","910","POLICIERS","04","AGENT CL 04","09","Agent","003","Enquêteur Poste   50","prêt"]
["SQ9921","Ferron","Carl",6854,"Poste pr Vallée-de-l'or","2001-11-01","2006-10-29","910","POLICIERS","04","AGENT CL 04","09","Agent","001","Patrouilleur"]
["SQ9921","Ferron","Carl",6854,"Poste pr Vallée-de-l'or","2006-10-30","2007-03-30","910","POLICIERS","04","AGENT CL 04","09","Agent","003","Enquêteur Poste   50"]
["SQ9921","Ferron","Carl",6854,"Poste pr Vallée-de-l'or","2007-03-31","2008-11-20","910","POLICIERS","04","AGENT CL 04","09","Agent","001","Patrouilleur"]
["SQ9921","Ferron","Carl",6854,"Poste pr Vallée-de-l'or","2008-11-21","2010-11-18","910","POLICIERS","12","SERGENT CL 12","07","Sergent","003","Enquêteur Poste   50"]
["SQ9921","Ferron","Carl",6854,"Poste pr Vallée-de-l'or","2010-11-19","2014-06-30","910","POLICIERS","12","SERGENT CL 12","07","Sergent","003","Enquêteur Poste   50"]
["SQ9921","Ferron","Carl",6854,"Poste pr Vallée-de-l'or","2014-07-01","2014-12-31","910","POLICIERS","12","SERGENT CL 12","07","Sergent","003","Enquêteur Poste   50"]
["SQ9921","Ferron","Carl",6854,"Poste pr Vallée-de-l'or","2015-01-01","2016-05-01","910","POLICIERS","12","SERGENT CL 12","07","Sergent","003","Enquêteur Poste   50"]
["SQ9921","Ferron","Carl",7434,"Poste pr Vallée-de-l'or","2016-05-02","2016-11-13","910","POLICIERS","12","SERGENT CL 12","07","Sergent","003","Enquêteur Poste   50"]
["SQ9921","Ferron","Carl",8676,"Éq enq MRC Vallée-de-l'Or","2016-11-14",null,"910","POLICIERS","12","SERGENT CL 12","07","Sergent","003","Enquêteur Poste   50","MSO"]
["SQ9927","Fortier","Steve",6854,"Poste pr Vallée-de-l'or","2004-11-05","2010-01-17","910","POLICIERS","04","AGENT CL 04","09","Agent","001","Patrouilleur"]
["SQ9927","Fortier","Steve",6854,"Poste pr Vallée-de-l'or","2010-01-18","2010-11-18","910","POLICIERS","04","AGENT CL 04","09","Agent","113","Superv De Relève","prêt"]
["SQ9927","Fortier","Steve",6854,"Poste pr Vallée-de-l'or","2010-11-19","2011-04-13","910","POLICIERS","04","AGENT CL 04","09","Agent","113","Superv De Relève","prêt"]
["SQ9927","Fortier","Steve",6854,"Poste pr Vallée-de-l'or","2011-04-14","2011-08-18","910","POLICIERS","12","SERGENT CL 12","07","Sergent","113","Superv De Relève"]
["SQ9927","Fortier","Steve",6854,"Poste pr Vallée-de-l'or","2011-08-19","2015-08-30","910","POLICIERS","12","SERGENT CL 12","07","Sergent","113","Superv De Relève"]
["SQ9927","Fortier","Steve",6854,"Poste pr Vallée-de-l'or","2015-08-31","2016-03-28","910","POLICIERS","12","SERGENT CL 12","07","Sergent","074","Adj Resp Poste    50","prêt"]
["SQ9927","Fortier","Steve",6854,"Poste pr Vallée-de-l'or","2016-03-29","2016-05-01","910","POLICIERS","12","SERGENT CL 12","07","Sergent","113","Superv De Relève"]
["SQ9927","Fortier","Steve",7434,"Poste pr Vallée-de-l'or","2016-05-02","2017-01-15","910","POLICIERS","12","SERGENT CL 12","07","Sergent","113","Superv De Relève"]
["SQ9927","Fortier","Steve",6432,"CSMRC Val d'Or","2017-01-16","2018-05-21","910","POLICIERS","12","SERGENT CL 12","07","Sergent","178","Off Aux Opérations","prêt"]
["SQ9950","Rouillard","Pascal",6854,"Poste pr Vallée-de-l'or","2006-03-03","2010-11-18","910","POLICIERS","04","AGENT CL 04","09","Agent","001","Patrouilleur"]
["SQ9950","Rouillard","Pascal",6854,"Poste pr Vallée-de-l'or","2010-11-19","2015-04-30","910","POLICIERS","04","AGENT CL 04","09","Agent","001","Patrouilleur"]
["SQ9950","Rouillard","Pascal",6854,"Poste pr Vallée-de-l'or","2015-05-01","2015-10-31","910","POLICIERS","04","AGENT CL 04","09","Agent","001","Patrouilleur","abs sagir (110)"]
["SQ9950","Rouillard","Pascal",6854,"Poste pr Vallée-de-l'or","2015-11-01","2016-05-01","910","POLICIERS","04","AGENT CL 04","09","Agent","001","Patrouilleur"]
["SQ9950","Rouillard","Pascal",7434,"Poste pr Vallée-de-l'or","2016-05-02",null,"910","POLICIERS","04","AGENT CL 04","09","Agent","001","Patrouilleur"]
["SQ9965","Turbide","Daniel",6854,"Poste pr Vallée-de-l'or","2001-12-01","2006-06-17","910","POLICIERS","04","AGENT CL 04","09","Agent","001","Patrouilleur"]
["SQ9965","Turbide","Daniel",6854,"Poste pr Vallée-de-l'or","2006-06-18","2009-01-04","910","POLICIERS","12","SERGENT CL 12","07","Sergent","113","Superv De Relève"]
["SQ9965","Turbide","Daniel",6854,"Poste pr Vallée-de-l'or","2009-01-05","2009-04-03","910","POLICIERS","12","SERGENT CL 12","07","Sergent","003","Enquêteur Poste   50","prêt"]
["SQ9965","Turbide","Daniel",6854,"Poste pr Vallée-de-l'or","2009-04-04","2010-11-18","910","POLICIERS","12","SERGENT CL 12","07","Sergent","113","Superv De Relève"]
["SQ9965","Turbide","Daniel",6854,"Poste pr Vallée-de-l'or","2010-11-19","2011-02-24","910","POLICIERS","12","SERGENT CL 12","07","Sergent","113","Superv De Relève"]
["SQ9965","Turbide","Daniel",6854,"Poste pr Vallée-de-l'or","2011-09-17","2013-09-23","910","POLICIERS","12","SERGENT CL 12","07","Sergent","113","Superv De Relève"]

{"sheet":"Constats par matricule","index":1,"n_rows":233,"n_cols":19,"rows_kept":233,"cut":false,"hidden":false,"merged":[[0,0,0,4],[0,5,0,18]]}
["Identitié des policiers ayant émis des contraventions pour paix et bon ordre alimentées à l'unité pq40144 entre 2005 et 2017   ",null,null,null,null,"Distribution du nombre de constats émis pour paix et bon ordre selon le matricule et l'année de l'émission des constats "]
["Matricule","Présent au fichier du mouvement du personnel policier de l'unité 144 entre 2005 et 2017","Nom","Prénom","Nombre d'années durant lesquelles le policier comptabilise des constats pour règlements municipaux au PQ40144",2005,2006,2007,2008,2009,2010,2011,2012,2013,2014,2015,2016,2017,"Total "]
[8086,"oui","Fleurent","Daniel",6,2,3,1,4,null,5,5,null,null,null,null,null,null,20]
[8942,"oui","Coutu","Benoît",3,1,null,null,7,1,null,null,null,null,null,null,null,null,9]
[9290,"oui","Corriveau","Ghislain",1,null,null,null,null,null,null,null,null,null,1,null,null,null,1]
[9458,"oui","Routhier","Michel",6,1,1,2,3,null,3,1,null,null,null,null,null,null,11]
[9523,"oui","Paul","Christian",6,null,null,1,2,4,null,null,null,1,3,1,null,null,12]
[9558,"oui","Veillette","David",12,1,4,8,10,10,6,7,13,4,7,15,1,null,86]
[9678,"oui","Simard","Myriam",1,2,null,null,null,null,null,null,null,null,null,null,null,null,2]
[9921,"oui","Ferron","Carl",2,1,1,null,null,null,null,null,null,null,null,null,null,null,2]
[9927,"oui","Fortier","Steve",11,2,4,19,8,16,8,4,2,1,3,2,null,null,69]
[9950,"oui","Rouillard","Pascal",9,null,4,17,9,18,16,9,4,6,2,null,null,null,85]
[9965,"oui","Turbide","Daniel",4,5,null,4,2,2,null,null,null,null,null,null,null,null,13]
[10113,"oui","Sabourin","Patrick",10,null,1,8,12,14,9,2,6,4,5,10,null,null,71]
[10492,"oui","Durant","Robert",1,2,null,null,null,null,null,null,null,null,null,null,null,null,2]
[10496,"oui","Lejeune","Mélanie",1,null,1,null,null,null,null,null,null,null,null,null,null,null,1]
[10498,"oui","Ouellet","Sylvie",7,2,null,12,6,1,1,2,1,null,null,null,null,null,25]
[10504,"oui","Sirois","Daniel",1,null,1,null,null,null,null,null,null,null,null,null,null,null,1]
[11135,"oui","Plante","Marc-André",6,17,4,null,null,null,null,8,11,null,null,null,1,1,42]
[11199,"oui","Beauchamp","Lyne",2,3,1,null,null,null,null,null,null,null,null,null,null,null,4]
[11241,"oui","Scodeller","Tonino",2,6,3,null,null,null,null,null,null,null,null,null,null,null,9]
[11255,"oui","Tremblay","Jonathan",2,4,8,null,null,null,null,null,null,null,null,null,null,null,12]
[11273,"oui","April","Marc",3,24,15,11,null,null,null,null,null,null,null,null,null,null,50]
[11279,"oui","St-Louis","Guillaume",3,2,3,4,null,null,null,null,null,null,null,null,null,null,9]
[11281,"oui","Dion","Claude",3,1,2,11,null,null,null,null,null,null,null,null,null,null,14]
[11305,"oui","Rankin","Terry",2,1,9,null,null,null,null,null,null,null,null,null,null,null,10]
[11346,"oui","Moran","Suzie",1,5,null,null,null,null,null,null,null,null,null,null,null,null,5]
[11421,"oui","Lévesque","Christian",4,1,4,11,2,null,null,null,null,null,null,null,null,null,18]
[11448,"oui","Aubé","Kerry",4,5,8,4,4,null,null,null,null,null,null,null,null,null,21]
[11551,"oui","Boutin","Marie-Andrée",5,1,5,3,9,3,null,null,null,null,null,null,null,null,21]
[11552,"oui","Pigeon","Mathieu",3,3,7,5,null,null,null,null,null,null,null,null,null,null,15]
[11574,"oui","Brousseau","Joëlle",3,null,1,7,13,null,null,null,null,null,null,null,null,null,21]
[11588,"oui","Richard","Pascal",9,null,null,null,null,1,4,1,3,8,12,6,3,2,40]
[11589,"oui","Boulanger","Geoffroy",1,7,null,null,null,null,null,null,null,null,null,null,null,null,7]
[11595,"oui","Cousineau","Simon",1,5,null,null,null,null,null,null,null,null,null,null,null,null,5]
[11607,"oui","Millette","Lysanne",6,1,null,null,3,4,22,3,1,null,null,null,null,null,34]
[11620,"oui","Pierre","James",1,4,null,null,null,null,null,null,null,null,null,null,null,null,4]
[11636,"oui","Descôteaux","Claudie",1,3,null,null,null,null,null,null,null,null,null,null,null,null,3]
[11641,"oui","Toupin","Isabelle",1,7,null,null,null,null,null,null,null,null,null,null,null,null,7]
[11657,"oui","Brunet","Mylène",3,6,4,1,null,null,null,null,null,null,null,null,null,null,11]
[11722,"oui","Moreau","Raymond",5,null,2,4,5,8,10,null,null,null,null,null,null,null,29]
[11756,"oui","Bélanger","Marie-Eve",3,null,1,null,null,4,11,null,null,null,null,null,null,null,16]
[11788,"oui","Guertin","Michel",2,null,17,27,null,null,null,null,null,null,null,null,null,null,44]
[11791,"oui","Claveau","Régis",4,null,null,4,5,4,11,null,null,null,null,null,null,null,24]
[11827,"oui","Landry","André-Benoit",8,null,null,4,6,7,9,4,2,null,1,1,null,null,34]
[11848,"oui","Rivest","Philippe",4,null,2,6,8,10,null,null,null,null,null,null,null,null,26]
[11904,"oui","Lareau","François",3,27,14,null,null,null,3,null,null,null,null,null,null,null,44]
[11943,"oui","Audet","Philippe",12,1,5,8,19,30,37,36,34,29,55,44,null,5,303]
[11944,"oui","Shaffer","Dominique",9,2,2,2,null,5,null,12,17,16,13,12,null,null,81]
[11972,"oui","Benoit","David",11,null,null,4,14,10,7,5,11,23,17,30,13,5,139]
[11976,"oui","Lachance","Louis Maxime",5,null,null,null,12,35,19,29,1,null,null,null,null,null,96]
[12003,"oui","Allaire-Champagne","Yan",2,null,null,null,null,null,null,9,7,null,null,null,null,null,16]
[12089,"oui","Jacques","Michaël",5,null,null,null,19,21,25,22,10,null,null,null,null,null,97]
[12092,"oui","Gaudet","Cynthia",2,null,6,6,null,null,null,null,null,null,null,null,null,null,12]
[12130,"oui","Loranger","Marie-Claude",2,null,5,3,null,null,null,null,null,null,null,null,null,null,8]
[12138,"oui","Dionne","Dominic",3,11,14,17,null,null,null,null,null,null,null,null,null,null,42]
[12148,"oui","Désabrais","Nancy",10,2,13,16,12,13,19,10,16,12,null,7,null,null,120]
[12224,"oui","Godbout","Jonathan",8,1,15,28,12,17,17,16,9,null,null,null,null,null,115]
[12236,"oui","Carbonneau","François",10,null,null,null,2,17,26,49,27,52,31,9,7,8,228]
[12297,"oui","Marcoux","Jean-Philippe",2,null,null,null,null,25,2,null,null,null,null,null,null,null,27]
[12307,"oui","Castonguay","Pierre-Luc",6,null,4,13,12,3,null,1,1,null,null,null,null,null,34]
[12335,"oui","Petit",{"$f":"VLOOKUP(A62,[1]Feuil5!$A$1:$C$65536,3,FALSE)","v":"Alexandre"},2,null,5,5,null,null,null,null,null,null,null,null,null,null,10]
[12387,"oui","Thibodeau","Pierre-Luc",10,null,3,10,38,27,null,null,16,50,48,31,12,1,236]
[12391,"oui","Lafrance","Kevin",10,null,null,10,9,8,8,12,12,18,3,3,1,null,84]
[12419,"oui","Frenette","Annabelle",6,null,null,null,null,null,null,null,1,17,27,20,11,1,77]
[12428,"oui","Mandeville","David",5,null,1,17,23,13,null,null,null,null,null,null,null,1,55]
[12486,"oui","Veilleux","Dominic",7,null,null,null,null,10,26,9,7,5,16,5,null,null,78]
[12518,"oui","Bélisle","Francis",5,null,null,null,null,null,10,19,23,31,32,null,null,null,115]
[12529,"oui","Collin","David",11,null,null,22,42,41,32,32,18,36,26,26,5,2,282]
[12594,"oui","Morin","Laurent",7,null,null,null,null,null,null,12,39,44,49,32,9,1,186]
[12597,"oui","Roussil","Steve",11,null,null,4,13,21,32,24,39,13,23,21,5,2,197]
[12603,"oui","Naud","Patrick",11,null,null,2,19,32,34,45,45,27,42,36,8,6,296]
[12604,"oui","Bédard","Alexandre",6,null,null,2,21,12,16,10,5,null,null,null,null,null,66]
[12644,"oui","Poitras","Valérie",2,null,null,null,null,null,null,10,1,null,null,null,null,null,11]
[12758,"oui","Boucher","Philippe",4,null,null,null,12,15,18,1,null,null,null,null,null,null,46]
[12776,"oui","Fortier","Benoît",10,null,null,null,10,34,45,35,43,36,38,23,13,8,285]
[12780,"oui","Venne","Christian",9,null,null,null,11,16,16,17,21,18,23,11,2,null,135]
[12786,"oui","Lemieux","Vincent",6,null,null,null,null,null,null,null,3,19,34,23,26,4,109]
[12790,"oui","Tanguay","Bernard",4,null,null,null,7,9,14,10,null,null,null,null,null,null,40]
[12802,"oui","Lafleur","Maxime",4,null,null,null,null,null,null,null,7,17,25,16,null,null,65]
[12827,"oui","Doyon","Carl",9,null,null,null,3,15,28,25,13,19,32,16,8,null,159]
[12851,"oui","Labrecque","Maxime",10,null,null,null,7,34,29,27,25,35,35,27,9,1,229]
[12871,"oui","Gervais","Martin",5,null,null,null,5,17,26,32,35,null,null,null,null,null,115]
[12905,"oui","Drouin","Simon",4,null,null,null,null,null,null,null,5,12,18,23,null,null,58]
[12959,"oui","Gosselin","Benoît",4,null,null,null,null,null,null,null,null,25,30,24,4,null,83]
[12989,"oui","Drolet","Jean Raphaël",6,null,null,null,null,1,null,null,4,37,126,67,4,null,239]
[13015,"oui","Turcotte","François",5,null,null,null,null,null,null,null,null,16,17,12,7,2,54]
[13024,"oui","Morin","Guillaume",4,null,null,null,null,null,null,null,null,null,16,10,9,2,37]
[13025,"oui","Dorval","Stéphanie",1,null,null,null,null,null,null,null,null,null,null,null,2,null,2]
[13117,"oui","Gagnier","Pierre Carlos",6,null,null,null,null,4,32,37,19,22,null,null,17,null,131]
[13138,"oui","Laflamme","Jimmy",5,null,null,null,null,4,30,12,13,11,null,null,null,null,70]
[13156,"oui","Allard","Jean-Pierre",4,null,null,null,null,null,36,15,21,7,null,null,null,null,79]
[13201,"oui","Tanguay-Lévesque","Jean-François",4,null,null,null,null,null,32,34,26,22,null,null,null,null,114]
[13248,"oui","Lévesque","Catherine",3,null,null,null,null,null,null,null,null,3,25,27,null,null,55]
[13281,"oui","Meunier","Dany",7,null,null,null,null,null,18,26,23,17,17,12,2,null,115]
[13308,"oui","St-Jean-Bisson","Ian",4,null,null,null,null,null,23,47,87,12,null,null,null,null,169]
[13355,"oui","Nolin","Jonathan-Pierre",5,null,null,null,null,null,6,25,41,38,8,null,null,null,118]
[13370,"oui","Corriveau","Vincent",1,null,null,null,null,null,null,null,null,null,null,2,null,null,2]
[13384,"oui","Roy","Julie-Anne",2,null,null,null,null,null,null,null,null,null,null,8,2,null,10]
[13392,"oui","Chamberland","Olivier",4,null,null,null,null,null,null,null,null,null,7,11,29,1,48]
[13430,"oui","Lapointe","Caroline",6,null,null,null,null,null,null,13,21,30,29,17,3,null,113]
[13442,"oui","April","Francis",4,null,null,null,null,null,null,62,62,42,36,null,null,null,202]
[13447,"oui","Langlois","Emilie",4,null,null,null,null,null,null,30,50,47,26,null,null,null,153]
[13448,"oui","Charbonneau","Pierre-Luc",4,null,null,null,null,null,null,17,27,21,15,null,null,null,80]
[13484,"oui","Miron","Pier-Luc",4,null,null,null,null,null,null,null,null,null,9,51,14,4,78]
[13544,"oui","Giguère-Asselin","Alexandre",7,null,null,null,null,null,null,14,32,49,31,25,23,7,181]
[13569,"oui","Bolduc","Mathieu",4,null,null,null,null,null,null,2,13,23,6,null,null,null,44]
[13597,"oui","Beaulieu","Michaël",6,null,null,null,null,null,null,8,38,70,36,9,null,3,164]
[13672,"oui","Gévry","Cynthia",1,null,null,null,null,null,null,null,null,null,null,null,2,null,2]
[13748,"oui","Benoit","Tania",1,null,null,null,null,null,null,null,null,null,null,null,5,null,5]
[13789,"oui","Fortin","Mathieu",3,null,null,null,null,null,null,null,18,54,56,null,null,null,128]
[13807,"oui","Morin","Jason",6,null,null,null,null,null,null,null,18,25,23,26,8,1,101]
[13808,"oui","Morency-Landry","Merlin",2,null,null,null,null,null,null,null,null,null,null,null,10,5,15]
[13830,"oui","Boisvert","Anne-Marie",6,null,null,null,null,null,null,null,11,21,21,19,5,1,78]
[13925,"oui","Bourassa","Kellie",2,null,null,null,null,null,null,null,null,null,null,null,12,8,20]
[13951,"oui","Baril","Maxim",5,null,null,null,null,null,null,null,null,19,14,15,17,4,69]
[13980,"oui","Gosselin","Alexandre",2,null,null,null,null,null,null,null,null,null,null,null,1,1,2]
[13988,"oui","Lavoie","Audrey",5,null,null,null,null,null,null,null,null,12,30,24,16,5,87]
[13998,"oui","Charpentier","Simon",2,null,null,null,null,null,null,null,null,null,null,2,null,2,4]
[14005,"oui","Chamberland","Mathieu",1,null,null,null,null,null,null,null,null,null,null,null,null,5,5]
[14031,"oui","Gascon-Langelier","Simon",1,null,null,null,null,null,null,null,null,null,null,null,null,2,2]
[14040,"oui","Leclerc","Eric",3,null,null,null,null,null,null,null,null,null,11,11,6,null,28]
[14058,"oui","Boutin","Simon",3,null,null,null,null,null,null,null,null,null,29,43,17,null,89]
[14061,"oui","Maurice","Maxime",1,null,null,null,null,null,null,null,null,null,null,null,null,7,7]
[14087,"oui","Ouellet","Frédéric",3,null,null,null,null,null,null,null,null,null,58,69,35,null,162]
[14098,"oui","Bruneau","Alexandre",1,null,null,null,null,null,null,null,null,null,null,null,null,8,8]
[14100,"oui","Leblanc","Nicolas",1,null,null,null,null,null,null,null,null,null,null,null,null,21,21]
[14120,"oui","Savard","Mathieu",1,null,null,null,null,null,null,null,null,null,null,null,null,3,3]
[14165,"oui","Leblanc-Bilodeau","Patrice",4,null,null,null,null,null,null,null,null,null,2,39,23,6,70]
[14180,"oui","Brousseau","Mylène",1,null,null,null,null,null,null,null,null,null,null,null,null,2,2]
[14231,"oui","Girard","Nicolas",3,null,null,null,null,null,null,null,null,null,null,7,36,1,44]
[14234,"oui","Leclerc","François",2,null,null,null,null,null,null,null,null,null,null,6,23,null,29]
[14244,"oui","Dostie","Samuel",3,null,null,null,null,null,null,null,null,null,null,2,30,2,34]
[14249,"oui","Huard","Yanick",2,null,null,null,null,null,null,null,null,null,null,1,9,null,10]
[14254,"oui","Dagenais",{"$f":"VLOOKUP(A135,[1]Feuil5!$A$1:$C$65536,3,FALSE)","v":"Justine"},2,null,null,null,null,null,null,null,null,null,null,3,5,null,8]
[14255,"oui","Morin","Jeffrey",3,null,null,null,null,null,null,null,null,null,null,4,11,1,16]
[14256,"oui","Mercier","Rébécka",2,null,null,null,null,null,null,null,null,null,null,null,20,9,29]
[14263,"oui","Larouche-Fortier","Sébastien",2,null,null,null,null,null,null,null,null,null,null,null,8,4,12]
[14308,"oui","Aumond","Roxanne",2,null,null,null,null,null,null,null,null,null,null,null,4,1,5]
[14320,"oui","Dubé","Kevin",2,null,null,null,null,null,null,null,null,null,null,null,14,14,28]
[14323,"oui","Fortin",{"$f":"VLOOKUP(A141,[1]Feuil5!$A$1:$C$65536,3,FALSE)","v":"Jean-Philip"},2,null,null,null,null,null,null,null,null,null,null,null,9,2,11]
[14324,"oui","Dallaire",{"$f":"VLOOKUP(A142,[1]Feuil5!$A$1:$C$65536,3,FALSE)","v":"Dominic"},2,null,null,null,null,null,null,null,null,null,null,null,5,5,10]
[14325,"oui","Legault",{"$f":"VLOOKUP(A143,[1]Feuil5!$A$1:$C$65536,3,FALSE)","v":"Anthony"},2,null,null,null,null,null,null,null,null,null,null,null,9,11,20]
[14439,"oui","Lapointe",{"$f":"VLOOKUP(A144,[1]Feuil5!$A$1:$C$65536,3,FALSE)","v":"Maxime"},1,null,null,null,null,null,null,null,null,null,null,null,null,4,4]
[14503,"oui","Guenard",{"$f":"VLOOKUP(A145,[1]Feuil5!$A$1:$C$65536,3,FALSE)","v":"Gabriel"},1,null,null,null,null,null,null,null,null,null,null,null,null,7,7]
[14516,"oui","Veillette",{"$f":"VLOOKUP(A146,[1]Feuil5!$A$1:$C$65536,3,FALSE)","v":"Marc-Antoine"},1,null,null,null,null,null,null,null,null,null,null,null,null,3,3]
[14533,"oui","Pelchat",{"$f":"VLOOKUP(A147,[1]Feuil5!$A$1:$C$65536,3,FALSE)","v":"Jean-Philip"},1,null,null,null,null,null,null,null,null,null,null,null,null,2,2]
[14537,"oui","Cote",{"$f":"VLOOKUP(A148,[1]Feuil5!$A$1:$C$65536,3,FALSE)","v":"Melina"},1,null,null,null,null,null,null,null,null,null,null,null,null,1,1]
[12894,"non","Beaudoin-Bruneau","Geneviève",1,null,null,null,null,null,null,null,null,null,null,null,1,null,1]
[11993,"non","Beaulieu","Iannick",1,null,null,null,null,null,null,null,null,1,null,null,null,null,1]
[13943,"non","Bédard","Jennifer",1,null,null,null,null,null,null,null,null,null,1,null,null,null,1]
[14198,"non","Blanchet","Francis",1,null,null,null,null,null,null,null,null,null,null,1,null,null,1]
[12210,"non","Bougie","Guylain",1,null,null,null,null,null,null,null,null,null,null,1,null,null,1]
[14056,"non","Brière","Derek",1,null,null,null,null,null,null,null,null,null,null,2,null,null,2]
[12394,"non","Côté","Sophie",2,null,null,null,null,null,null,null,2,2,null,null,null,null,4]
[13508,"non","Coutu","Martine",1,null,null,null,null,null,null,null,1,null,null,null,null,null,1]
[12578,"non","Dufresne","Régis",3,null,null,null,null,null,3,null,1,2,null,null,null,null,6]
[9758,"non","Duquette","David",1,null,null,null,null,null,null,null,null,null,1,null,null,null,1]
[2,"non","Erreur probable d'alimentation du matricule ",null,1,null,null,null,null,null,null,null,null,null,null,1,null,null,1]
[19,"non","Erreur probable d'alimentation du matricule ",null,2,null,null,null,null,null,null,null,1,1,null,null,null,null,2]
[215,"non","Erreur probable d'alimentation du matricule ",null,1,null,null,null,null,null,null,null,null,null,null,1,null,null,1]
[1239,"non","Erreur probable d'alimentation du matricule ",null,1,null,null,null,null,null,null,null,1,null,null,null,null,null,1]
[1603,"non","Erreur probable d'alimentation du matricule ",null,1,null,null,null,null,null,null,null,1,null,null,null,null,null,1]
[1908,"non","Erreur probable d'alimentation du matricule ",null,1,null,null,null,null,null,null,null,1,null,null,null,null,null,1]
[17324,"non","Erreur probable d'alimentation du matricule ",null,1,null,null,null,null,null,null,null,null,null,null,null,null,1,1]
[19324,"non","Erreur probable d'alimentation du matricule ",null,1,null,null,null,null,null,null,null,null,null,null,null,null,1,1]
[22989,"non","Erreur probable d'alimentation du matricule ",null,1,null,null,null,null,null,null,null,null,null,null,1,null,null,1]
[89008,"non","Erreur probable d'alimentation du matricule ",null,5,null,null,null,1,null,1,1,4,1,null,null,null,null,8]
[123989,"non","Erreur probable d'alimentation du matricule ",null,1,null,null,null,null,null,null,null,null,1,null,null,null,null,1]
[125897,"non","Erreur probable d'alimentation du matricule ",null,1,null,null,null,null,null,1,null,null,null,null,null,null,null,1]
[125941,"non","Erreur probable d'alimentation du matricule ",null,1,null,null,null,null,null,null,null,null,null,null,1,null,null,1]
[126044,"non","Erreur probable d'alimentation du matricule ",null,1,null,null,null,null,null,null,1,null,null,null,null,null,null,1]
[133544,"non","Erreur probable d'alimentation du matricule ",null,1,null,null,null,null,null,null,null,null,null,2,null,null,null,2]
[133840,"non","Erreur probable d'alimentation du matricule ",null,1,null,null,null,null,null,null,null,null,null,null,1,null,null,1]
[135947,"non","Erreur probable d'alimentation du matricule ",null,1,null,null,null,null,null,null,null,1,null,null,null,null,null,1]
[140087,"non","Erreur probable d'alimentation du matricule ",null,1,null,null,null,null,null,null,null,null,null,null,1,null,null,1]
[201512,"non","Erreur probable d'alimentation du matricule ",null,1,null,null,null,null,null,null,null,null,null,null,1,null,null,1]
[12770,"non","Frenette","Josianne",1,null,null,null,null,null,null,null,null,null,1,null,null,null,1]
[11947,"non","Gargantini","Marco",1,null,null,null,null,1,null,null,null,null,null,null,null,null,1]
[12943,"non","Gingras","Simon",1,null,null,null,null,null,null,null,1,null,null,null,null,null,1]
[8482,"non","Godbout","Gilles",2,null,null,null,null,null,1,null,1,null,null,null,null,null,2]
[14164,"non","Guindon Baker","Shawn",1,null,null,null,null,null,null,null,null,null,null,3,null,null,3]
[13510,"non","Holmes","Cindy",2,null,null,null,null,null,null,2,1,null,null,null,null,null,3]
[12766,"non","Jubinville-Gagnon","Chrystel",1,null,null,null,null,null,null,null,null,null,null,1,null,null,1]
[12447,"non","Labelle","Benoît",1,null,null,null,null,null,null,null,1,null,null,null,null,null,1]
[12403,"non","Labonté","Steve",1,null,null,null,null,null,null,null,null,null,null,1,null,null,1]
[12748,"non","Labonté","Jérôme",1,null,null,null,1,null,null,null,null,null,null,null,null,null,1]
[12972,"non","Labonté","Jacinthe",1,null,null,null,null,null,null,1,null,null,null,null,null,null,1]
[11974,"non","Labrecque","Gabriel",1,null,null,null,null,null,null,null,null,1,null,null,null,null,1]
[10904,"non","Lacroix","Sylvain",1,1,null,null,null,null,null,null,null,null,null,null,null,null,1]
[13958,"non","Lafontaine","Kim",1,null,null,null,null,null,null,null,null,null,null,1,null,null,1]
[12276,"non","Laforest","Jean Christophe",1,null,null,null,1,null,null,null,null,null,null,null,null,null,1]
[13603,"non","Lamoureux","Julie",1,null,null,null,null,null,null,null,4,null,null,null,null,null,4]
[13440,"non","Larivière","Jean-François",1,null,null,null,null,null,null,null,null,null,null,1,null,null,1]
[12544,"non","Leblanc","Natacha",2,null,null,null,null,null,null,1,null,1,null,null,null,null,2]
[12951,"non","Lemieux","Jean-François",1,null,null,null,null,null,null,null,null,1,null,null,null,null,1]
[11973,"non","Lemire","Gabriel",2,null,null,null,null,null,2,null,2,null,null,null,null,null,4]
[12484,"non","Lévesque-Delaunais","Jean-François",1,null,null,null,null,null,null,null,null,null,null,1,null,null,1]
[12761,"non","Mercier","Isabelle",1,null,null,null,null,null,1,null,null,null,null,null,null,null,1]
[13443,"non","Millette","Jonatan",1,null,null,null,null,null,null,null,1,null,null,null,null,null,1]
[13591,"non","Morin","Etienne",2,null,null,null,null,null,null,null,null,null,1,1,null,null,2]
[9868,"non","Morissette","Miguel",2,null,null,null,3,1,null,null,null,null,null,null,null,null,4]
[13594,"non","Nolin","Katrine",1,null,null,null,null,null,null,null,1,null,null,null,null,null,1]
[12983,"non","Nolin-Bouchard","Jean-François",1,null,null,null,null,null,null,null,null,null,null,null,null,2,2]
[10493,"non","Non disponible dans le registre RH",null,1,1,null,null,null,null,null,null,null,null,null,null,null,null,1]
[12726,"non","Non disponible dans le registre RH",null,1,null,null,null,null,null,null,null,null,null,null,1,null,null,1]
[12976,"non","Non disponible dans le registre RH",null,2,null,null,null,null,7,4,null,null,null,null,null,null,null,11]
[14432,"non","Non disponible dans le registre RH",null,1,null,null,null,null,null,null,null,null,null,null,null,null,1,1]
[14452,"non","Non disponible dans le registre RH",null,1,null,null,null,null,null,null,null,null,null,null,null,null,1,1]
[14456,"non","Non disponible dans le registre RH",null,1,null,null,null,null,null,null,null,null,null,null,null,null,1,1]
[14459,"non","Non disponible dans le registre RH",null,1,null,null,null,null,null,null,null,null,null,null,null,null,1,1]
[14460,"non","Non disponible dans le registre RH",null,1,null,null,null,null,null,null,null,null,null,null,null,null,4,4]
[14462,"non","Non disponible dans le registre RH",null,1,null,null,null,null,null,null,null,null,null,null,null,null,1,1]
[12459,"non","Ouellet","Benoit",1,null,null,null,null,null,null,null,null,null,null,1,null,null,1]
[12966,"non","Paré-Beaudoin","Bryan",1,null,null,null,null,null,null,null,2,null,null,null,null,null,2]
[14014,"non","Poirier","Guillaume",2,null,null,null,null,null,null,null,null,null,null,2,1,null,3]
[13897,"non","Poulin","Valérie",1,null,null,null,null,null,null,null,null,null,1,null,null,null,1]
[13937,"non","Prokopetz","Francis",1,null,null,null,null,null,null,null,null,null,null,null,null,1,1]
[11942,"non","Pronovost","Matthieu",2,null,null,null,null,null,null,null,null,1,null,1,null,null,2]
[12904,"non","Richer","Stéphane",1,null,null,null,null,null,1,null,null,null,null,null,null,null,1]
[12574,"non","Roberge","Danielle",1,null,null,null,null,null,null,null,null,null,null,1,null,null,1]
[13827,"non","Roy","Maude",1,null,null,null,null,null,null,null,null,1,null,null,null,null,1]
[12988,"non","Santarossa","Loris",1,null,null,null,null,null,null,null,null,null,null,1,null,null,1]
[12954,"non","Savard-Gauthier","Anne-Marie",1,null,null,null,null,null,null,null,null,2,null,null,null,null,2]
[12807,"non","St-Pierre","Louis",1,null,null,null,null,null,null,null,null,null,null,1,null,null,1]
[14161,"non","Sylvestre","Geneviève",2,null,null,null,null,null,null,null,null,null,null,3,null,1,4]
[13115,"non","Tardif","Jean Philippe",1,null,null,null,null,null,null,null,null,null,null,1,null,null,1]
[13018,"non","Tessier","Serge",1,null,null,null,null,null,null,null,null,null,1,null,null,null,1]
[13968,"non","Vachon","Maxime",1,null,null,null,null,null,null,null,null,null,null,null,null,2,2]
[13287,"non","Verret","Jean-François",1,null,null,null,null,null,null,null,1,null,null,null,null,null,1]
[11994,"non","Vienneau","Mathieu",1,null,null,null,null,1,null,null,null,null,null,null,null,null,1]
[12446,"non","Viens","Édith",1,null,null,null,null,null,null,null,1,null,null,null,null,null,1]
["Total",null,null,null,null,171,203,343,446,606,795,903,1087,1191,1307,1028,592,232,{"$f":"SUM(F233:R233)","v":8904}]

{"sheet":"# de constats","index":2,"n_rows":8905,"n_cols":1,"rows_kept":8905,"cut":false,"hidden":false,"merged":[]}
["# de constat "]
["805003784"]
["804258614"]
["803897650"]
["804636506"]
["803753623"]
["803897864"]
["803774909"]
["801765595"]
["801765596"]
["801774721"]
["801656855"]
["801656867"]
["803102592"]
["803102600"]
["803250601"]
["803250603"]
["803250606"]
["802272343"]
["802930502"]
["802930503"]
["802930504"]
["802220710"]
["803250613"]
["803250621"]
["803477141"]
["803477142"]
["803522127"]
["803250557"]
["803524192"]
["801725372"]
["802636586"]
["802208946"]
["802208947"]
["802208948"]
["802208944"]
["802636577"]
["802636578"]
["802636582"]
["804165282"]
["802208985"]
["801568195"]
["803309935"]
["803309936"]
["803309946"]
["802209096"]
["802209090"]
["802209091"]
["802208988"]
["802209099"]
["803524276"]
["804623526"]
["803031139"]
["803031140"]
["803074926"]
["803074942"]
["802636953"]
["802930114"]
["802256897"]
["804249367"]
["804602609"]
["804602610"]
["804258886"]
["804567963"]
["804567973"]
["804812078"]
["804812081"]
["804812086"]
["804812087"]
["804812088"]
["804812090"]
["804812100"]
["804999151"]
["804999155"]
["804999159"]
["805414053"]
["805414051"]
["805414057"]
["801765049"]
["802208503"]
["802208509"]
["802208523"]
["801568542"]
["803102775"]
["803353955"]
["803353971"]
["803353958"]
["803353966"]
["803353972"]
["802930238"]
["802930239"]
["803102756"]
["803147413"]
["803074869"]
["803074870"]
["803074871"]
["803102758"]
["803102760"]
["803102770"]
["802209219"]
["802637801"]
["802637815"]
["802637819"]
["802637820"]
["802664231"]
["802930234"]
["802930235"]
["802930236"]
["802930237"]
["802336760"]
["802336771"]
["802336636"]
["802336637"]
["802336643"]
["802256951"]
["802256963"]
["804240496"]
["804240498"]
["804240499"]
["804567951"]
["804567953"]
["804567956"]
["804567962"]
["803452990"]
["803524651"]
["803451075"]
["803524655"]
["803524659"]
["803524668"]
["803524669"]
["803913623"]
["804194003"]
["804194004"]
["804240478"]
["803753543"]
["803753545"]
["803753546"]
["803753630"]
["803753631"]
["803880226"]
["803880235"]
["803880236"]
["804194002"]
["803880239"]
["803880242"]
["803913880"]
["803913900"]
["801568360"]
["801765178"]
["804596302"]
["802664499"]
["802930304"]
["802930305"]
["802930306"]
["801568350"]
["804623117"]
["804812422"]
["801774579"]
["801774585"]
["801774592"]
["802208651"]
["801349347"]
["801765902"]
["803250854"]
["803309912"]
["803309917"]
["803309924"]
["803309925"]
["803250851"]
["803250859"]
["803250860"]
["803147328"]
["803147331"]
["803147336"]
["803147343"]
["803147347"]
["803147348"]
["803147346"]
["803031753"]
["803031763"]
["803309918"]
["803031764"]
["803031765"]
["803309919"]
["803309904"]
["803309920"]
["803309921"]
["802636653"]
["802636227"]
["802636228"]
["802636237"]
["802636244"]
["802636243"]
["802636245"]
["802636246"]
["802208664"]
["802208667"]
["802208668"]
["802208671"]
["802336476"]
["802336478"]
["802336481"]
["802336482"]
["802336486"]
["802336483"]
["802336485"]
["802336487"]
["802336488"]
["802336490"]
["802336491"]
["802336494"]
["802336492"]
["802336498"]
["802336499"]
["804258545"]
["804258549"]
["804623101"]
["803250866"]
["803250867"]
["803714013"]
["803753731"]
["803873849"]
["803897240"]
["803897241"]
["801353571"]
["802220728"]
["802220735"]
["803353585"]
["803353592"]
["803353818"]
["803090553"]
["803090566"]
["803353812"]
["803090574"]
["803090575"]
["802958878"]
["802958889"]
["802958890"]
["802958879"]
["803353821"]
["802958885"]
["802958891"]
["803102018"]
["803147738"]
["803147739"]
["803147741"]
["803102003"]
["803074477"]
["803074478"]
["803074486"]
["803074487"]
["803074489"]
["803074492"]
["803309832"]
["803309834"]
["803309835"]
["803309836"]
["803309837"]
["803090569"]
["803309844"]
["802636948"]
["802664031"]
["802664034"]
["802664036"]
["802664043"]
["802664044"]
["803147002"]
["803147003"]
["803147017"]
["802336808"]
["802336810"]
["802336811"]
["802336812"]
["802336814"]
["802336820"]
["802336877"]
["802336885"]
["802336889"]
["802208485"]
["802208486"]
["802208488"]
["802208489"]
["802208490"]
["802636926"]
["802636927"]
["804335778"]
["804339101"]
["803646993"]
["803646997"]
["803714106"]
["803524785"]
["803524799"]
["803522356"]
["803522362"]
["803522366"]
["803577528"]
["803913337"]
["804185701"]
["804185703"]
["804185712"]
["804166135"]
["804249583"]
["803577541"]
["803865657"]
["803865660"]
["803913336"]
["801656247"]
["801656960"]
["801656970"]
["801656968"]
["801774352"]
["803147585"]
["803309754"]
["802636467"]
["802636473"]
["802208636"]
["802316007"]
["802316009"]
["802316025"]
["804249718"]
["804249721"]
["804249724"]
["804249725"]
["804812053"]
["804812054"]
["804812058"]
["804812059"]
["804812062"]
["804812063"]
["802208801"]
["803031940"]
["803102431"]
["803102430"]
["803102433"]
["803102439"]
["803102446"]
["803230254"]
["803230258"]
["803230260"]
["803147079"]
["803031948"]
["803147084"]
["803031926"]
["803031928"]
["803147096"]
["803031932"]
["803147097"]
["803147099"]
["803147100"]
["803031934"]
["803031936"]
["803031937"]
["803031939"]
["802636571"]
["802636301"]
["802636302"]
["802636303"]
["802636305"]
["802636306"]
["802636313"]
["802930479"]
["802930495"]
["802930496"]
["802930497"]
["802930500"]
["802336080"]
["802336905"]
["802336909"]
["802336908"]
["802336925"]
["802336924"]
["802336918"]
["802636901"]
["804249701"]
["804249713"]
["804249714"]
["804249715"]
["804249719"]
["803230262"]
["803477726"]
["803865815"]
["803865816"]
["803865818"]
["803865824"]
["803477734"]
["803477735"]
["803865463"]
["803865467"]
["803865469"]
["803865475"]
["801656617"]
["801725216"]
["801656633"]
["801765353"]
["801656632"]
["801656634"]
["803309871"]
["803309503"]
["802636602"]
["802636612"]
["802636616"]
["802636618"]
["802636624"]
["802664839"]
["802208539"]
["802277234"]
["802277235"]
["802277236"]
["802277247"]
["802277212"]
["802277211"]
["802277214"]
["802272982"]
["802272984"]
["802272983"]
["802272988"]
["803452728"]
["803504955"]
["803522711"]
["801765877"]
["801765389"]
["805389479"]
["805389494"]
["801774983"]
["801774217"]
["802208634"]
["802208761"]
["801656373"]
["801656932"]
["801656941"]
["801656942"]
["801656950"]
["801765303"]
["801765128"]
["801765319"]
["801765651"]
["801765653"]
["801765654"]
["801765655"]
["801774126"]
["801774127"]
["801774201"]
["801774205"]
["801774206"]
["803524603"]
["803524605"]
["803524606"]
["803524607"]
["803524612"]
["803524619"]
["803524621"]
["803524622"]
["803524187"]
["803577104"]
["803577107"]
["803577115"]
["803577116"]
["803524188"]
["803577125"]
["803880429"]
["803880443"]
["803865388"]
["803865396"]
["801774089"]
["801765060"]
["801765692"]
["801765062"]
["801349147"]
["801774030"]
["801774042"]
["801765155"]
["801765175"]
["801774226"]
["801774227"]
["801774229"]
["801774230"]
["801774401"]
["801774405"]
["801774408"]
["801774412"]
["801774416"]
["801774417"]
["801568896"]
["801568899"]
["801656248"]
["801765093"]
["801774291"]
["801774292"]
["801774293"]
["801774294"]
["801774296"]
["801774115"]
["801774116"]
["801774117"]
["801774903"]
["801774909"]
["801774910"]
["801774911"]
["801774912"]
["801774731"]
["801974129"]
["801656451"]
["801656452"]
["801656453"]
["801656454"]
["801656455"]
["801539493"]
["801539494"]
["801539497"]
["801539495"]
["801539496"]
["801539499"]
["801765676"]
["801765677"]
["801765678"]
["801765679"]
["801765680"]
["801765683"]
["801765684"]
["801765685"]
["801765686"]
["801765696"]
["801774278"]
["801774287"]
["802273749"]
["802273750"]
["802213680"]
["802213681"]
["802213687"]
["802208453"]
["802208461"]
["802208465"]
["802208447"]
["802208005"]
["802208012"]
["801765500"]
["801977126"]
["802220813"]
["801765493"]
["801765494"]
["802220824"]
["802256881"]
["802256882"]
["802256887"]
["801774761"]
["801974004"]
["801765537"]
["802273694"]
["802336282"]
["802336283"]
["802336657"]
["802336664"]
["802336667"]
["802336668"]
["802336560"]
["802336570"]
["802277754"]
["802277755"]
["801656215"]
["801656217"]
["801656220"]
["801656224"]
["801656225"]
["802208705"]
["802208706"]
["802208707"]
["802208712"]
["801656207"]
["801568667"]
["801656889"]
["801656890"]
["801656891"]
["801765718"]
["802208856"]
["802208857"]
["801656549"]
["802277829"]
["802277834"]
["802208858"]
["802208861"]
["802256929"]
["802256946"]
["802256947"]
["802336586"]
["802336590"]
["802336596"]
["802209802"]
["802209814"]
["801765272"]
["801765274"]
["801774551"]
["801774361"]
["801774784"]
["801349543"]
["801349544"]
["801349545"]
["801335175"]
["801656770"]
["801656771"]
["801765266"]
["801765271"]
["802636780"]
["802636783"]
["802664069"]
["802930203"]
["802273759"]
["802213653"]
["802209508"]
["801774090"]
["802208876"]
["802208885"]
["802208889"]
["801774080"]
["803147432"]
["803147438"]
["803147443"]
["802209132"]
["802209145"]
["802637754"]
["802637770"]
["802664482"]
["802664484"]
["802664485"]
["802664491"]
["802208892"]
["802208896"]
["802336725"]
["801774383"]
["801977344"]
["801974089"]
["801974096"]
["802220830"]
["802220836"]
["802336126"]
["801765774"]
["801765775"]
["802336147"]
["802336380"]
["802336384"]
["802336394"]
["802277402"]
["801774310"]
["802636176"]
["802636186"]
["802636188"]
["802636195"]
["802636197"]
["802636198"]
["802636200"]
["802664302"]
["802664306"]
["802664309"]
["802664310"]
["802664311"]
["802664313"]
["802208053"]
["802208055"]
["802208071"]
["802208072"]
["802256862"]
["802256864"]
["802256871"]
["804917306"]
["804985901"]
["804985903"]
["804544937"]
["804544941"]
["805413884"]
["805571580"]
["805571581"]
["805411513"]
["805266092"]
["805266093"]
["803147896"]
["803147889"]
["803147890"]
["803147876"]
["804249789"]
["804339483"]
["804339499"]
["804339500"]
["804563454"]
["804563464"]
["804563463"]
["804563467"]
["804563468"]
["804563470"]
["804563472"]
["803147898"]
["803873775"]
["803859814"]
["803859820"]
["804166456"]
["804166470"]
["804166317"]
["804249782"]
["804249571"]
["803754027"]
["803873756"]
["803873755"]
["801656522"]
["801765011"]
["801765010"]
["801765017"]
["801774026"]
["801774027"]
["801765101"]
["801765110"]
["801765112"]
["801765113"]
["801765118"]
["801765553"]
["802930409"]
["802930410"]
["803353753"]
["803353754"]
["803353767"]
["803353771"]
["802930411"]
["802930412"]
["803090304"]
["803090310"]
["803090312"]
["803090313"]
["803090314"]
["803090316"]
["803250305"]
["803250306"]
["803250310"]
["803250311"]
["803250314"]
["803230328"]
["803230339"]
["803230348"]
["802664971"]
["803031958"]
["803353765"]
["803031966"]
["802664642"]
["802664643"]
["802664960"]
["803258426"]
["803258444"]
["803258448"]
["803714093"]
["801656731"]
["801765331"]
["801765332"]
["801765337"]
["801568248"]
["801765702"]
["801765707"]
["801656312"]
["801656319"]
["801656324"]
["801765225"]
["801774511"]
["801774521"]
["801774523"]
["801765867"]
["801765870"]
["801774783"]
["801568386"]
["801568387"]
["801568388"]
["801765851"]
["801765852"]
["801568399"]
["801975595"]
["802208907"]
["803258251"]
["803309186"]
["803309188"]
["803309200"]
["803309189"]
["803309195"]
["803309196"]
["803258256"]
["803258253"]
["803258254"]
["802930332"]
["802930333"]
["803031310"]
["802930336"]
["803031309"]
["803031306"]
["803031319"]
["803031320"]
["802277286"]
["802277299"]
["802277296"]
["802277297"]
["802208922"]
["802208919"]
["802336081"]
["802336089"]
["802336090"]
["801977206"]
["803031990"]
["803031991"]
["803031993"]
["803090337"]
["803090339"]
["803090340"]
["803090343"]
["803250277"]
["803250279"]
["803250283"]
["803102711"]
["803102713"]
["803090331"]
["803102724"]
["801774882"]
["801774885"]
["801656406"]
["801774893"]
["802208601"]
["802208602"]
["802208604"]
["802208611"]
["802208612"]
["802208613"]
["802208625"]
["802208624"]
["802208616"]
["802208617"]
["802208618"]
["802208619"]
["802208621"]
["802336002"]
["802336025"]
["802336252"]
["802336253"]
["802336254"]
["802336258"]
["802336259"]
["802336263"]
["802336264"]
["802336266"]
["802336267"]
["802336268"]
["802336269"]
["802336270"]
["802336271"]
["802336529"]
["802336532"]
["802336530"]
["802336535"]
["802336537"]
["802336541"]
["802336542"]
["802336544"]
["802336546"]
["802336545"]
["802336547"]
["802336548"]
["803031671"]
["803309276"]
["803309278"]
["803309282"]
["803309298"]
["803309299"]
["803250577"]
["803250578"]
["803250582"]
["802930588"]
["803147968"]
["803031651"]
["803031655"]
["802636157"]
["802636163"]
["802636171"]
["802930578"]
["802930581"]
["802220872"]
["802273708"]
["802256992"]
["802256993"]
["803897941"]
["803309820"]
["803090371"]
["803090375"]
["803250132"]
["803250133"]
["803250131"]
["803250141"]
["803102958"]
["802930613"]
["803031340"]
["802930625"]
["803031339"]
["803102527"]
["803102526"]
["803102537"]
["802277445"]
["802636815"]
["802636819"]
["802664246"]
["802664247"]
["802208082"]
["802208088"]
["802277431"]
["803897938"]
["803102968"]
["803524504"]
["803524507"]
["803524872"]
["803524184"]
["803524186"]
["801974029"]
["802220756"]
["802209164"]
["803031516"]
["803031517"]
["803031523"]
["803074828"]
["803031524"]
["803102676"]
["803102680"]
["803102681"]
["803102693"]
["802209154"]
["802209156"]
["802209157"]
["802209158"]
["802209169"]
["802209159"]
["802209160"]
["802209161"]
["802220761"]
["802220763"]
["802220767"]
["802220774"]
["802220769"]
["802220772"]
["801774268"]
["801774269"]
["801774270"]
["801774271"]
["801765441"]
["801765445"]
["801765449"]
["801977251"]
["801977252"]
["801765450"]
["801656404"]
["801656405"]
["801656408"]
["801656979"]
["801765133"]
["801765134"]
["801765140"]
["801765138"]
["801765143"]
["801765150"]
["801765376"]
["801765394"]
["801765393"]
["801765398"]
["801765399"]
["801765400"]
["801765429"]
["801765430"]
["801774028"]
["801774251"]
["801774252"]
["801774253"]
["801774254"]
["801774255"]
["801774256"]
["801774257"]
["801774258"]
["801774260"]
["801774266"]
["803031373"]
["803230276"]
["803230277"]
["804917396"]
["803859787"]
["804602574"]
["804623705"]
["804623706"]
["804623709"]
["804623711"]
["804623721"]
["804623722"]
["804917376"]
["804917378"]
["804917379"]
["804917382"]
["804917381"]
["804917386"]
["804917388"]
["804917395"]
["804917399"]
["804811677"]
["804811684"]
["804811685"]
["804811687"]
["804811688"]
["804811689"]
["804811690"]
["804811691"]
["804811694"]
["804811698"]
["804811699"]
["805004276"]
["805004277"]
["805004278"]
["805004279"]
["805004280"]
["805004281"]
["805004282"]
["805004285"]
["805004286"]
["805004295"]
["805004296"]
["804999488"]
["805004298"]
["805004299"]
["805004300"]
["804998580"]
["805414179"]
["805414185"]
["805414190"]
["805414197"]
["805414198"]
["801975538"]
["801975546"]
["801977313"]
["802208105"]
["802208109"]
["801765511"]
["803102204"]
["803102205"]
["803102210"]
["803102211"]
["803102222"]
["803102224"]
["803353926"]
["803353929"]
["803353931"]
["803353932"]
["803250364"]
["803353936"]
["803353938"]
["803353939"]
["803353940"]
["803353943"]
["803353944"]
["803353945"]
["803353946"]
["803353947"]
["803250351"]
["803250352"]
["803250354"]
["803250355"]
["803250361"]
["803250362"]
["803250363"]
["803250365"]
["803250366"]
["803250367"]
["803250368"]
["803250373"]
["803250374"]
["803250375"]
["803258102"]
["803258108"]
["803258114"]
["802930663"]
["802930664"]
["803102216"]
["802930665"]
["802930667"]
["802930668"]
["802930669"]
["802930670"]
["803309005"]
["803309006"]
["803309007"]
["803309025"]
["802930673"]
["803102220"]
["803031158"]
["803031162"]
["803031168"]
["803031170"]
["803031171"]
["803031172"]
["803031174"]
["803309002"]
["803309011"]
["803309013"]
["803309014"]
["803309016"]
["803309020"]
["803309021"]
["803309022"]
["803102201"]
["802336746"]
["802336748"]
["802336750"]
["802636351"]
["802636355"]
["802636356"]
["802636359"]
["802636361"]
["802636362"]
["802636363"]
["802636364"]
["802636365"]
["802636366"]
["802636367"]
["802636368"]
["802636370"]
["802636374"]
["802636373"]
["802636375"]
["802208110"]
["802208123"]
["802336726"]
["802336729"]
["802336730"]
["802336731"]
["802336737"]
["802336749"]
["804240587"]
["804240588"]
["804240595"]
["804240599"]
["804240600"]
["804335351"]
["804335352"]
["804335353"]
["804335354"]
["804335355"]
["804335356"]
["804335357"]
["804335368"]
["804335363"]
["804335364"]
["804335365"]
["804335372"]
["804335374"]
["804335726"]
["804335727"]
["804335728"]
["804335729"]
["804335731"]
["804335734"]
["804335735"]
["804335739"]
["804335740"]
["804335741"]
["804335743"]
["804335745"]
["804335747"]
["804335749"]
["804567976"]
["804567981"]
["804567982"]
["804567989"]
["804567990"]
["804567991"]
["804567998"]
["803873711"]
["803873712"]
["803873714"]
["803873715"]
["803873716"]
["803873718"]
["803873721"]
["804623719"]
["803873724"]
["804602554"]
["804602558"]
["804602559"]
["804602562"]
["804602563"]
["804602564"]
["804602567"]
["803258115"]
["803258116"]
["803258117"]
["803258119"]
["803258121"]
["803258123"]
["803646230"]
["803646236"]
["803646238"]
["803646239"]
["803646245"]
["803452226"]
["803452228"]
["803452229"]
["803452231"]
["803452234"]
["803452245"]
["803452237"]
["803452247"]
["803452426"]
["803452427"]
["803452428"]
["803452440"]
["803452441"]
["803452443"]
["803452444"]
["803452445"]
["803452448"]
["803504451"]
["803504452"]
["803504453"]
["803504454"]
["803504457"]
["803504458"]
["803504459"]
["803504461"]
["803888464"]
["803888465"]
["803888468"]
["803888470"]
["803888473"]
["803859777"]
["803859778"]
["803859781"]
["803859782"]
["803859783"]
["803859785"]
["803859788"]
["803859789"]
["803859791"]
["803859792"]
["803859794"]
["803859795"]
["803859796"]
["803859797"]
["803859798"]
["804185931"]
["803859800"]
["804185928"]
["804185929"]
["804185930"]
["804185933"]
["804185940"]
["804185943"]
["804240576"]
["803504463"]
["803504464"]
["803504465"]
["803504469"]
["803504470"]
["803504472"]
["803504473"]
["803753285"]
["803753286"]
["803753288"]
["803753292"]
["803753293"]
["803753294"]
["803753297"]
["803863186"]
["803863187"]
["803863188"]
["803863199"]
["803897777"]
["803913002"]
["803913011"]
["803913012"]
["803913013"]
["803913014"]
["803913017"]
["803913018"]
["803913022"]
["803897444"]
["803913025"]
["803888452"]
["803888457"]
["803888458"]
["803888462"]
["803888463"]
["804623139"]
["804623756"]
["804623772"]
["804916526"]
["804916540"]
["804916542"]
["804823359"]
["804823360"]
["804823053"]
["804823054"]
["805003576"]
["805003579"]
["802208277"]
["802208170"]
["801656825"]
["801765233"]
["802209194"]
["802209195"]
["803031536"]
["803031548"]
["803074704"]
["802209180"]
["802209199"]
["804240916"]
["804335822"]
["804339403"]
["804339415"]
["804339424"]
["804335027"]
["804335042"]
["804602328"]
["804602339"]
["804602342"]
["804335047"]
["804596935"]
["804596943"]
["803074718"]
["803477554"]
["803074723"]
["803074724"]
["803477566"]
["803477574"]
["803477575"]
["803504855"]
["803504856"]
["803504857"]
["803504858"]
["803524077"]
["804166980"]
["804166989"]
["804166886"]
["804194656"]
["804194657"]
["804194670"]
["804194671"]
["804194674"]
["804194675"]
["804194456"]
["804194457"]
["804194459"]
["804194463"]
["804240914"]
["803524087"]
["803753565"]
["803753575"]
["803863126"]
["803863134"]
["803863136"]
["803863137"]
["803863142"]
["803865281"]
["803873414"]
["803873415"]
["803865285"]
["803865287"]
["803865289"]
["803865294"]
["803897776"]
["803897778"]
["803309008"]
["804602500"]
["804596170"]
["804567084"]
["804567085"]
["804567088"]
["804567091"]
["804567098"]
["804335648"]
["804822545"]
["804822547"]
["804822918"]
["804636514"]
["804636501"]
["804636505"]
["804636507"]
["804636508"]
["804636510"]
["804636513"]
["804636515"]
["804636520"]
["804636521"]
["804636522"]
["804636523"]
["804636524"]
["804636525"]
["805003826"]
["805003827"]
["805003828"]
["805003837"]
["805414379"]
["805437056"]
["805437059"]
["805571909"]
["805571916"]
["805571917"]
["805571919"]
["805413717"]
["805413720"]
["805388951"]
["805388959"]
["805388971"]
["805388918"]
["805388672"]
["805388673"]
["805295302"]
["805711966"]
["805902226"]
["803309417"]
["803353376"]
["803353390"]
["803353396"]
["803353397"]
["803250251"]
["803250264"]
["803147386"]
["803147387"]
["803147396"]
["803031732"]
["803031746"]
["803031750"]
["803309406"]
["803309413"]
["803309414"]
["802636506"]
["802636507"]
["802636514"]
["802636515"]
["802636518"]
["802636522"]
["802636524"]
["802930126"]
["802930132"]
["802930135"]
["802930137"]
["802664072"]
["802664073"]
["802664074"]
["802336549"]
["802336550"]
["802636881"]
["802636882"]
["804249121"]
["804249123"]
["804249124"]
["804249125"]
["804240241"]
["804240246"]
["804563280"]
["804563289"]
["804563299"]
["804563300"]
["804567767"]
["804567775"]
["804596387"]
["804596388"]
["804596393"]
["804596398"]
["804602497"]
["803714527"]
["803714547"]
["803477765"]
["803504946"]
["803504941"]
["803913355"]
["803913365"]
["803913368"]
["803913369"]
["803913370"]
["803913371"]
["803877027"]
["803877035"]
["803877045"]
["803877047"]
["804185864"]
["804185869"]
["804185870"]
["804258251"]
["804258252"]
["804258254"]
["804258257"]
["804258259"]
["804258262"]
["804258263"]
["804258265"]
["804258271"]
["804249105"]
["803504961"]
["803504962"]
["803774996"]
["803753164"]
["803753174"]
["803913242"]
["803913237"]
["803873893"]
["803873894"]
["803877145"]
["803877146"]
["803102218"]
["803258103"]
["803880451"]
["803863189"]
["804185854"]
["803102671"]
["803309962"]
["803309254"]
["803309262"]
["803309270"]
["803309271"]
["803309151"]
["803309154"]
["803309155"]
["803309159"]
["803309160"]
["803250551"]
["803250552"]
["803250553"]
["803250556"]
["803250558"]
["803250559"]
["803250563"]
["803250651"]
["802930888"]
["802930889"]
["803031720"]
["803031721"]
["803147651"]
["803031722"]
["803147652"]
["803147654"]
["803031723"]
["803147656"]
["803147661"]
["803102662"]
["803147663"]
["803147665"]
["803102660"]
["803147672"]
["803031715"]
["803031716"]
["803102601"]
["803102664"]
["803102603"]
["803102663"]
["803102605"]
["803102606"]
["803102612"]
["803102623"]
["803102624"]
["803102625"]
["803309274"]
["803102653"]
["803102665"]
["803074800"]
["803309951"]
["803102668"]
["802636533"]
["802664430"]
["802664433"]
["802664435"]
["802664436"]
["802664437"]
["802664442"]
["802664438"]
["802664446"]
["802664450"]
["802930876"]
["803250657"]
["803250659"]
["803250660"]
["803250662"]
["803250664"]
["803250665"]
["803250667"]
["803250575"]
["803250671"]
["803250674"]
["803477354"]
["803477358"]
["803477359"]
["803477364"]
["803477363"]
["803477369"]
["803477370"]
["803477826"]
["803477827"]
["803477829"]
["803477830"]
["803477831"]
["803477834"]
["803477372"]
["803477836"]
["803477838"]
["803477840"]
["803477844"]
["803477846"]
["803504254"]
["804240578"]
["803031550"]
["803646003"]
["803646004"]
["803646019"]
["803477423"]
["803477419"]
["803524827"]
["803524829"]
["803524830"]
["803524837"]
["803524849"]
["803524850"]
["803753153"]
["803753154"]
["803753155"]
["803753160"]
["803753162"]
["803309464"]
["803309466"]
["803309467"]
["803102403"]
["803102420"]
["803090708"]
["803090709"]
["803090712"]
["803090713"]
["803090714"]
["803090725"]
["803090717"]
["803090721"]
["803090722"]
["803250452"]
["803250456"]
["803250463"]
["803250472"]
["803250474"]
["803258201"]
["803258202"]
["803258203"]
["803258209"]
["803147132"]
["803147133"]
["803147134"]
["803031280"]
["803031284"]
["803031287"]
["803031288"]
["803031289"]
["803031290"]
["803031294"]
["803031295"]
["803031296"]
["803031300"]
["803031297"]
["803031298"]
["803309455"]
["803309459"]
["803309460"]
["803309461"]
["803309462"]
["803309463"]
["802664077"]
["802664081"]
["802664084"]
["802664088"]
["802664093"]
["802664094"]
["802664100"]
["802664526"]
["802664527"]
["802664543"]
["802664544"]
["802930279"]
["802930287"]
["802930288"]
["802930290"]
["802930291"]
["802930293"]
["802930294"]
["802930297"]
["803646112"]
["803646118"]
["803646119"]
["803646120"]
["803646122"]
["803477426"]
["803477430"]
["803477432"]
["803522082"]
["803522085"]
["803522086"]
["803522097"]
["803522098"]
["803522099"]
["803522100"]
["803524005"]
["803524012"]
["803524013"]
["803524019"]
["803524020"]
["803524023"]
["803524024"]
["803753504"]
["803753506"]
["803753515"]
["803753519"]
["803753520"]
["803753522"]
["803753523"]
["803753525"]
["803863157"]
["803863158"]
["801774402"]
["801774480"]
["801774483"]
["802208140"]
["802208141"]
["802208142"]
["802209326"]
["802209331"]
["802209332"]
["802209340"]
["802277276"]
["801774658"]
["801774659"]
["801774670"]
["801774367"]
["801774368"]
["802256755"]
["802256756"]
["802277358"]
["801975559"]
["801774928"]
["801774936"]
["801774938"]
["801774939"]
["801774947"]
["801774945"]
["801774946"]
["801977382"]
["801977383"]
["801977398"]
["802208182"]
["802208184"]
["802208188"]
["801765928"]
["801765935"]
["801765937"]
["801765938"]
["801765944"]
["801765945"]
["801765949"]
["801975551"]
["801975552"]
["801975553"]
["801975554"]
["802208193"]
["802208195"]
["802208200"]
["802256823"]
["802336828"]
["802336833"]
["802277955"]
["802336836"]
["802336837"]
["802277982"]
["802277983"]
["802277985"]
["802277993"]
["802278000"]
["802277994"]
["802277995"]
["804166292"]
["804166294"]
["804166295"]
["804822653"]
["804822657"]
["804822658"]
["804822659"]
["801774338"]
["802208214"]
["801774952"]
["802208208"]
["801774953"]
["801774954"]
["801774958"]
["801774959"]
["801774963"]
["801774964"]
["802208202"]
["802208222"]
["802208223"]
["801774329"]
["801774330"]
["803309981"]
["803309995"]
["803309997"]
["803090604"]
["803090605"]
["803090606"]
["803090608"]
["803090609"]
["803090615"]
["803090619"]
["803090620"]
["803090622"]
["803090623"]
["803250101"]
["803250103"]
["803250104"]
["803250108"]
["803250118"]
["803250119"]
["803031234"]
["803031235"]
["803031239"]
["803031249"]
["803031250"]
["803074778"]
["803074797"]
["803074788"]
["803074790"]
["803074791"]
["803074792"]
["803074799"]
["803309976"]
["802636695"]
["802637800"]
["802636698"]
["802636699"]
["802637778"]
["802637788"]
["802637790"]
["802930626"]
["802930628"]
["802930627"]
["802930630"]
["802930631"]
["802336352"]
["802336362"]
["802336365"]
["802336368"]
["802336370"]
["802336406"]
["802336407"]
["802336412"]
["802336415"]
["802336422"]
["802272953"]
["802272954"]
["802272956"]
["802272959"]
["802272973"]
["802636676"]
["803646590"]
["803646591"]
["803477178"]
["803522211"]
["803477200"]
["803577639"]
["803522202"]
["803522220"]
["803504637"]
["803504638"]
["803859391"]
["803859394"]
["803859395"]
["803859400"]
["804166284"]
["804185134"]
["804185135"]
["804185136"]
["804185139"]
["804185143"]
["804166276"]
["804166282"]
["803504648"]
["803577630"]
["803577631"]
["803577634"]
["803577637"]
["803577638"]
["803577641"]
["803577645"]
["803753938"]
["803753939"]
["803873917"]
["803873916"]
["803913676"]
["803913678"]
["803913679"]
["803913684"]
["805412028"]
["801774984"]
["801774996"]
["801774998"]
["801774999"]
["801974128"]
["801974130"]
["802208232"]
["802208236"]
["802208238"]
["802208239"]
["802208240"]
["802208244"]
["802208245"]
["802208246"]
["801774602"]
["803102518"]
["803102453"]
["803102454"]
["803102451"]
["803102472"]
["803102519"]
["803102520"]
["803353676"]
["803353677"]
["803353678"]
["803353682"]
["803353686"]
["803353688"]
["803353689"]
["803353691"]
["803353692"]
["802664020"]
["802664022"]
["803147755"]
["803102517"]
["803147760"]
["803102516"]
["803147761"]
["803147767"]
["803147773"]
["803147775"]
["803102502"]
["803102509"]
["803102510"]
["803102511"]
["803102512"]
["803102515"]
["802220562"]
["802637576"]
["802637582"]
["802220575"]
["802637594"]
["802637595"]
["802664003"]
["802664007"]
["802664008"]
["802664009"]
["802664011"]
["802664013"]
["802336056"]
["802336058"]
["802336061"]
["802256828"]
["802256831"]
["802256838"]
["802256840"]
["802256841"]
["802256847"]
["802336866"]
["802336867"]
["802336869"]
["802336870"]
["802336873"]
["802336874"]
["802208404"]
["802336857"]
["802208410"]
["802208414"]
["802208415"]
["802208417"]
["802208420"]
["802208421"]
["802208423"]
["802220552"]
["802220554"]
["802220568"]
["803353694"]
["803646627"]
["803646628"]
["803477201"]
["803646647"]
["803646648"]
["803477208"]
["803522001"]
["803522002"]
["803522016"]
["803522020"]
["803522021"]
["803522023"]
["803522024"]
["803522025"]
["803524451"]
["803524458"]
["803524466"]
["803754001"]
["803754005"]
["803754006"]
["803754007"]
["803754008"]
["803754012"]
["803754013"]
["804596303"]
["804596306"]
["804596312"]
["804596313"]
["804596314"]
["804596315"]
["804822699"]
["805004162"]
["805414001"]
["805414006"]
["805414007"]
["805500002"]
["805572329"]
["805414008"]
["805414009"]
["805414010"]
["805414178"]
["805712057"]
["805414012"]
["805414013"]
["805414014"]
["805414015"]
["805414016"]
["805414017"]
["803102296"]
["803309337"]
["803309339"]
["803309348"]
["803309349"]
["803309350"]
["803353851"]
["803353852"]
["803353859"]
["803353860"]
["803353866"]
["803353867"]
["803353872"]
["803353874"]
["803258330"]
["803250733"]
["803250734"]
["803250735"]
["803250736"]
["803250737"]
["803250738"]
["803258328"]
["803258329"]
["803258333"]
["803258332"]
["803147102"]
["803147103"]
["803147113"]
["803147114"]
["803147123"]
["803147124"]
["803031876"]
["803031877"]
["803147125"]
["803031878"]
["803074578"]
["803074590"]
["803074599"]
["803102732"]
["803102735"]
["803102276"]
["803147502"]
["803147503"]
["804249810"]
["804249471"]
["804249811"]
["804249812"]
["804249813"]
["804249814"]
["804249815"]
["804249817"]
["804249818"]
["804249819"]
["804249820"]
["804249821"]
["804249822"]
["804249823"]
["804249824"]
["804339587"]
["804258002"]
["804258004"]
["804258006"]
["804258009"]
["804249267"]
["804249268"]
["804249270"]
["804567276"]
["804258013"]
["804258014"]
["804258015"]
["804258016"]
["804602408"]
["804602410"]
["804602431"]
["803258334"]
["803258335"]
["803258339"]
["803258342"]
["803258345"]
["803258346"]
["803258348"]
["803258350"]
["803646029"]
["803646034"]
["803646036"]
["803646040"]
["803646041"]
["803258849"]
["803477251"]
["803477255"]
["803477258"]
["803477261"]
["803477262"]
["803477263"]
["803477268"]
["803477269"]
["803477270"]
["803477271"]
["803477273"]
["803646717"]
["803522261"]
["803522262"]
["803522263"]
["803522264"]
["803522267"]
["803522269"]
["803522270"]
["803522271"]
["803522273"]
["803524642"]
["803524643"]
["803524647"]
["803524648"]
["803524649"]
["803504526"]
["803504527"]
["803504529"]
["803504536"]
["803504539"]
["803504540"]
["803504541"]
["803888518"]
["803888519"]
["803859755"]
["803859756"]
["803859759"]
["803859760"]
["803859761"]
["803859763"]
["803859768"]
["803859769"]
["803859770"]
["803605267"]
["803605268"]
["803859771"]
["803859772"]
["803859773"]
["803859774"]
["803859775"]
["804194551"]
["804194552"]
["804194553"]
["804194554"]
["804194555"]
["804194556"]
["804194557"]
["804194561"]
["804194565"]
["804194566"]
["804194573"]
["804194574"]
["803859946"]
["804194575"]
["804166376"]
["804166377"]
["804166378"]
["804166379"]
["804166391"]
["804166392"]
["804166393"]
["804166395"]
["804166398"]
["804166399"]
["804166400"]
["804249801"]
["804249802"]
["804249803"]
["804249242"]
["804249244"]
["804249804"]
["804249805"]
["804249806"]
["804249807"]
["803504543"]
["803504550"]
["803504547"]
["803753578"]
["803753580"]
["803753582"]
["803754987"]
["803754988"]
["803753594"]
["803753595"]
["803753596"]
["803774969"]
["803873954"]
["803873958"]
["803873959"]
["803873960"]
["803873961"]
["803873963"]
["803873964"]
["803897829"]
["803873966"]
["803873967"]
["803395890"]
["803873972"]
["803865262"]
["803865263"]
["803865264"]
["802664613"]
["803102130"]
["803102131"]
["803147803"]
["803147805"]
["803147811"]
["803147812"]
["803147825"]
["803031410"]
["803031411"]
["803031412"]
["803031413"]
["803031414"]
["803031423"]
["803031213"]
["803031218"]
["803102128"]
["803102926"]
["803102927"]
["803102928"]
["803102930"]
["803102931"]
["803102934"]
["803102947"]
["803102948"]
["803102126"]
["803102127"]
["803102129"]
["801774632"]
["801774633"]
["801774636"]
["802208267"]
["803147456"]
["803147463"]
["803031367"]
["802637837"]
["802637840"]
["802637847"]
["802637848"]
["802637849"]
["802664179"]
["802664191"]
["802930393"]
["802664192"]
["802664198"]
["802664199"]
["802930386"]
["802336123"]
["802336939"]
["802336501"]
["802336511"]
["802336512"]
["802336515"]
["802336517"]
["802336518"]
["802336520"]
["802336522"]
["802277728"]
["802336922"]
["802277736"]
["803452626"]
["803913185"]
["801975608"]
["801975621"]
["801975622"]
["802208279"]
["802208292"]
["802336207"]
["802336208"]
["802336221"]
["802336220"]
["802336223"]
["804602940"]
["804602941"]
["804623552"]
["804623559"]
["804917401"]
["804917402"]
["804917405"]
["804917406"]
["804917407"]
["804917408"]
["804917213"]
["804917413"]
["804917414"]
["804917214"]
["804623562"]
["804917419"]
["804917221"]
["804917424"]
["804917425"]
["804986442"]
["804986443"]
["804986444"]
["804986445"]
["804986446"]
["804986450"]
["804999301"]
["805412201"]
["805412207"]
["805412209"]
["805412211"]
["805412214"]
["805412328"]
["805412222"]
["805412336"]
["805412338"]
["805412339"]
["805412343"]
["805412346"]
["805265776"]
["805265777"]
["805265779"]
["805265782"]
["802208318"]
["802336026"]
["802208323"]
["802930861"]
["802930872"]
["803147352"]
["803147356"]
["803147357"]
["803147358"]
["803147361"]
["803147362"]
["803147363"]
["803147374"]
["802930830"]
["802930841"]
["802930845"]
["802930848"]
["802930849"]
["802930850"]
["803074626"]
["803074627"]
["803074628"]
["803074630"]
["803074629"]
["803074639"]
["803074642"]
["803074643"]
["803309053"]
["803309054"]
["803309056"]
["802636426"]
["802636432"]
["802636444"]
["802636445"]
["802636276"]
["802636282"]
["802636283"]
["802636287"]
["802664280"]
["802664288"]
["802664290"]
["802664291"]
["802664292"]
["802664294"]
["802664295"]
["802664297"]
["802664298"]
["802664299"]
["802664876"]
["802664877"]
["802664878"]
["802664886"]
["802664887"]
["802664890"]
["802664891"]
["802664892"]
["802664893"]
["802664896"]
["802664898"]
["802664899"]
["802930754"]
["802930755"]
["802930826"]
["802930851"]
["802208324"]
["802208325"]
["802336235"]
["802336239"]
["802336466"]
["802336473"]
["802336474"]
["802277816"]
["802277818"]
["802277879"]
["804249451"]
["804249452"]
["804249453"]
["804249454"]
["804249461"]
["804249462"]
["804249466"]
["804249472"]
["804249473"]
["804249474"]
["804335985"]
["804335988"]
["804335991"]
["804335997"]
["804335998"]
["804339255"]
["804339256"]
["804339257"]
["804339266"]
["804563926"]
["804563929"]
["804563930"]
["804563373"]
["804563932"]
["804563941"]
["804563946"]
["804563947"]
["804339269"]
["804339273"]
["804339275"]
["804567527"]
["804567528"]
["804567529"]
["804567536"]
["804567537"]
["804567545"]
["804567546"]
["804567547"]
["804567548"]
["804567549"]
["804567550"]
["804602501"]
["804602508"]
["804602509"]
["804602511"]
["804602927"]
["804596512"]
["803873581"]
["803873582"]
["803873584"]
["803888469"]
["803873586"]
["803873591"]
["803873599"]
["803859464"]
["803859465"]
["803859467"]
["803859468"]
["803859469"]
["804166476"]
["804166477"]
["804166485"]
["804166486"]
["804166488"]
["804166494"]
["804185326"]
["804185327"]
["804258210"]
["804185291"]
["804194699"]
["804258209"]
["804258203"]
["804258211"]
["804258208"]
["804258214"]
["804258215"]
["804258220"]
["804258219"]
["804258222"]
["804258223"]
["804240426"]
["804240427"]
["804240439"]
["804240201"]
["804240202"]
["804240203"]
["804240204"]
["804240205"]
["804240206"]
["804240210"]
["804240211"]
["804240212"]
["804240215"]
["804240216"]
["804240217"]
["804240219"]
["804240220"]
["803310322"]
["803310324"]
["803310325"]
["803888151"]
["803888161"]
["803913186"]
["803913192"]
["803913195"]
["803913196"]
["803913197"]
["803913199"]
["803913200"]
["803873576"]
["803873578"]
["803873579"]
["804916837"]
["804916838"]
["804822642"]
["805266408"]
["803102269"]
["803102272"]
["803250155"]
["803250163"]
["803250171"]
["803258127"]
["803258128"]
["803147263"]
["803031006"]
["803031007"]
["803102059"]
["803102074"]
["803074622"]
["803102251"]
["803102252"]
["802636713"]
["802636071"]
["802636070"]
["802637879"]
["802664766"]
["802930156"]
["802930163"]
["802930165"]
["803147251"]
["802336173"]
["802336174"]
["802336789"]
["802336799"]
["802336685"]
["802336696"]
["802336977"]
["802336996"]
["802337000"]
["802636701"]
["804339778"]
["804339779"]
["804602002"]
["803258133"]
["803646414"]
["803646418"]
["803646419"]
["803646421"]
["803646423"]
["803646424"]
["803477476"]
["803477490"]
["803524536"]
["803524537"]
["803504178"]
["803877008"]
["803605309"]
["803605312"]
["803605317"]
["804194510"]
["804194521"]
["804194522"]
["804194524"]
["804194525"]
["804185055"]
["804185056"]
["804185057"]
["804185058"]
["804185065"]
["804185066"]
["804185074"]
["804258628"]
["804258632"]
["803504060"]
["803504062"]
["803504063"]
["803504200"]
["803753610"]
["803753611"]
["803753617"]
["803753621"]
["803913951"]
["803913957"]
["803913959"]
["803913965"]
["804249616"]
["804249617"]
["803753224"]
["803863083"]
["804811785"]
["804623478"]
["804623479"]
["804916507"]
["804916517"]
["804822977"]
["804822982"]
["804822983"]
["804822984"]
["804822985"]
["804822989"]
["804822990"]
["804822998"]
["804822999"]
["804823080"]
["804823082"]
["805004076"]
["804823095"]
["804823096"]
["804823097"]
["805004082"]
["805004091"]
["805004093"]
["805004095"]
["805004099"]
["805526079"]
["805437114"]
["805437116"]
["805437121"]
["805526078"]
["805526080"]
["805526092"]
["805711751"]
["804335231"]
["804335236"]
["804335247"]
["804916514"]
["804339508"]
["804339509"]
["804339510"]
["804339511"]
["804339513"]
["804339514"]
["804339517"]
["804339519"]
["804339521"]
["804563433"]
["804563436"]
["804563438"]
["804563628"]
["804563631"]
["804563634"]
["804563635"]
["804563636"]
["804563640"]
["804563642"]
["804602104"]
["804602105"]
["804602116"]
["804602117"]
["803904338"]
["803904342"]
["804240816"]
["803859561"]
["803859562"]
["804335230"]
["804166078"]
["804166079"]
["804166098"]
["804258376"]
["804258379"]
["804258385"]
["804258390"]
["804240802"]
["804258268"]
["804240804"]
["804240810"]
["803904329"]
["805322571"]
["802208376"]
["803031196"]
["803147569"]
["803031201"]
["803031326"]
["803031327"]
["803031333"]
["803031452"]
["803031454"]
["803031455"]
["803031457"]
["803031460"]
["803031465"]
["802277869"]
["802636387"]
["802636392"]
["802636212"]
["802636219"]
["802636220"]
["802636222"]
["802664107"]
["802664108"]
["802664103"]
["802664106"]
["802664111"]
["802664117"]
["802664554"]
["802664560"]
["802664570"]
["802664564"]
["802930603"]
["802664572"]
["802930204"]
["802930205"]
["802930219"]
["802256798"]
["802256799"]
["802336958"]
["802336610"]
["802336611"]
["802336616"]
["802336617"]
["802336621"]
["802277403"]
["802277405"]
["802277407"]
["802277411"]
["802277412"]
["802256896"]
["802277424"]
["802277873"]
["802277871"]
["803880019"]
["803865445"]
["804823411"]
["804823185"]
["804623068"]
["804823155"]
["805004026"]
["805004027"]
["803309748"]
["803309749"]
["803309750"]
["803353603"]
["803353610"]
["803353617"]
["803353614"]
["803353616"]
["803090527"]
["803090531"]
["803090538"]
["803090539"]
["803090549"]
["803353832"]
["803353833"]
["803353837"]
["803353838"]
["803353843"]
["802958753"]
["802958754"]
["802958755"]
["802958757"]
["802958766"]
["802958767"]
["802958771"]
["803258407"]
["803147702"]
["803102032"]
["803102041"]
["803102042"]
["803074831"]
["803309730"]
["803074833"]
["803074834"]
["803074848"]
["803309747"]
["804335850"]
["804339151"]
["804339167"]
["804339171"]
["804339727"]
["804339726"]
["804339729"]
["804339744"]
["804339745"]
["804335101"]
["804339750"]
["804563854"]
["804567108"]
["804596265"]
["804596266"]
["804596271"]
["803258411"]
["803258415"]
["803646703"]
["803646716"]
["803522330"]
["803522336"]
["803522350"]
["803504672"]
["804185414"]
["804240882"]
["804240884"]
["804240889"]
["804240892"]
["803524370"]
["803524371"]
["803753231"]
["803753183"]
["803753184"]
["803897526"]
["803897547"]
["803250901"]
["803258157"]
["803250902"]
["803250925"]
["803250924"]
["803250908"]
["803250911"]
["803250913"]
["803258151"]
["803258155"]
["804240574"]
["804240575"]
["804249334"]
["804249340"]
["804258200"]
["804249345"]
["804249347"]
["804249348"]
["804335452"]
["804335458"]
["804335459"]
["804335460"]
["804335461"]
["804335155"]
["804335157"]
["804335161"]
["804335164"]
["804335165"]
["804335170"]
["804335172"]
["804567793"]
["804596113"]
["804596114"]
["804596116"]
["804596117"]
["804596118"]
["804596119"]
["804596124"]
["804596125"]
["804602829"]
["804339249"]
["804567961"]
["803258580"]
["803258161"]
["803258171"]
["803646428"]
["803646429"]
["803646430"]
["803646608"]
["803646611"]
["803646438"]
["803646439"]
["803452822"]
["803522553"]
["803522560"]
["803522563"]
["803522574"]
["803504283"]
["803504286"]
["803504287"]
["803522703"]
["803897177"]
["803897180"]
["803897197"]
["803897199"]
["803859713"]
["803859714"]
["803859720"]
["804166451"]
["804166759"]
["804166801"]
["803859725"]
["804166805"]
["804166813"]
["804185185"]
["804166817"]
["804166818"]
["804258927"]
["804258932"]
["804258937"]
["804240511"]
["804258939"]
["804258187"]
["804258188"]
["804258189"]
["804185336"]
["804240553"]
["804240566"]
["804240569"]
["804240481"]
["803522719"]
["803753077"]
["803753084"]
["803753827"]
["803753828"]
["803753829"]
["803753833"]
["803753840"]
["803753086"]
["803753088"]
["803753094"]
["803753848"]
["803865481"]
["803865482"]
["803865483"]
["803865490"]
["803865493"]
["803913854"]
["803865880"]
["803865891"]
["803865892"]
["803865893"]
["803865898"]
["804602809"]
["804602811"]
["804602815"]
["804602816"]
["804916531"]
["804917064"]
["804917068"]
["804917069"]
["804812482"]
["804986397"]
["804812490"]
["804812491"]
["804812495"]
["804812499"]
["804812500"]
["805004259"]
["804986394"]
["805004254"]
["805004261"]
["805004263"]
["805004264"]
["805004267"]
["805004269"]
["805004271"]
["805004274"]
["805412254"]
["805412259"]
["805412270"]
["805412274"]
["805266019"]
["805266020"]
["805388588"]
["805388597"]
["803102302"]
["802930725"]
["803102308"]
["803102309"]
["803102312"]
["803102313"]
["803353101"]
["803353102"]
["803353106"]
["803353153"]
["803353111"]
["803353113"]
["803353114"]
["803353115"]
["803353120"]
["803353122"]
["803353704"]
["803353123"]
["803353124"]
["803353125"]
["803353701"]
["803353706"]
["803353707"]
["803353708"]
["803353710"]
["803353717"]
["803353723"]
["802958811"]
["802958814"]
["802958812"]
["802958823"]
["802930981"]
["802930991"]
["802930993"]
["802930997"]
["803147776"]
["803147778"]
["803147779"]
["803147781"]
["803147785"]
["803147786"]
["803147787"]
["803147790"]
["803031052"]
["803031053"]
["803031056"]
["803031057"]
["803031059"]
["803031061"]
["803031063"]
["803031065"]
["803031066"]
["803031067"]
["803031070"]
["803031072"]
["803031073"]
["803074528"]
["803074534"]
["803074535"]
["803074538"]
["803074539"]
["803074540"]
["803074546"]
["803074547"]
["803074548"]
["803309376"]
["803074549"]
["803309386"]
["803309389"]
["803309394"]
["803309397"]
["802277257"]
["802636410"]
["802636412"]
["802277270"]
["802636420"]
["802636421"]
["802636422"]
["802636257"]
["802636259"]
["802636266"]
["802636268"]
["802636271"]
["802636269"]
["802636273"]
["802636274"]
["802636275"]
["802664128"]
["802664134"]
["802664135"]
["802664138"]
["802664139"]
["802664143"]
["802664144"]
["802664145"]
["802664146"]
["802664147"]
["802664148"]
["802664926"]
["802664927"]
["802664930"]
["802664931"]
["802664933"]
["802664934"]
["802664937"]
["802664938"]
["802664939"]
["802664940"]
["802664941"]
["802664944"]
["802664945"]
["802664949"]
["802273353"]
["802273365"]
["802273364"]
["802273358"]
["802273366"]
["802273367"]
["802273369"]
["802273375"]
["802277902"]
["802209230"]
["802277903"]
["802209228"]
["802277905"]
["802277908"]
["802277916"]
["802277917"]
["802277925"]
["802209250"]
["802209241"]
["802209244"]
["802277254"]
["802277256"]
["804249733"]
["804249734"]
["804249743"]
["804339554"]
["804339556"]
["804339557"]
["804339562"]
["804339563"]
["804339564"]
["804339573"]
["804339574"]
["804335551"]
["804335552"]
["804335556"]
["804335564"]
["804335565"]
["804335567"]
["804567680"]
["804567681"]
["804567687"]
["804567700"]
["804602802"]
["804602803"]
["804596067"]
["803258557"]
["803250766"]
["803258569"]
["803258574"]
["803646802"]
["803646820"]
["803646821"]
["803452801"]
["803452802"]
["803452803"]
["803452805"]
["803452806"]
["803452818"]
["803452820"]
["803452823"]
["803477857"]
["803477859"]
["803477861"]
["803477862"]
["803477874"]
["803524683"]
["803524687"]
["803524686"]
["803524694"]
["803524696"]
["803524697"]
["803524151"]
["803524153"]
["803524159"]
["803524161"]
["803524162"]
["803897165"]
["803859176"]
["803859178"]
["803859180"]
["803859187"]
["804194404"]
["804194406"]
["804194408"]
["804194416"]
["804194417"]
["804194418"]
["804194419"]
["804194421"]
["804194422"]
["804194827"]
["804194829"]
["804194831"]
["804194833"]
["804194843"]
["804194847"]
["804194849"]
["804258952"]
["804258953"]
["804258955"]
["804258957"]
["804258959"]
["804258964"]
["804258968"]
["804258972"]
["804258975"]
["804240834"]
["804240837"]
["804240846"]
["804240847"]
["804240848"]
["804240849"]
["803524170"]
["803524172"]
["803753653"]
["803753654"]
["803865749"]
["803753664"]
["803753669"]
["803753671"]
["803774917"]
["803873403"]
["803873412"]
["803873413"]
["803865729"]
["803873422"]
["803865726"]
["803865733"]
["803865742"]
["803524737"]
["804194622"]
["804596824"]
["803250904"]
["803250906"]
["803258152"]
["804258931"]
["804240564"]
["803865487"]
["804596822"]
["804623664"]
["804623665"]
["804623674"]
["804916977"]
["804916990"]
["804916992"]
["804916993"]
["804916997"]
["804811703"]
["804811707"]
["804812328"]
["804812342"]
["804812343"]
["804812344"]
["805004476"]
["805004478"]
["805004480"]
["805004481"]
["805004485"]
["805004486"]
["805004487"]
["805004488"]
["804812347"]
["804812348"]
["804812349"]
["805004494"]
["805414079"]
["805414078"]
["805414081"]
["805414083"]
["805414086"]
["805414091"]
["805414092"]
["805411708"]
["805411710"]
["805411716"]
["805411722"]
["805266351"]
["805266364"]
["805388751"]
["805202679"]
["804240756"]
["804240757"]
["804240766"]
["804240767"]
["804240769"]
["804240770"]
["804339436"]
["804339439"]
["804335371"]
["804339303"]
["804339305"]
["804339306"]
["804339307"]
["804339313"]
["804339322"]
["804563202"]
["804339325"]
["804563201"]
["804563203"]
["804563204"]
["804563205"]
["804563210"]
["804563219"]
["804563225"]
["804567003"]
["804567007"]
["804567004"]
["804567010"]
["804567017"]
["804567019"]
["804567020"]
["804567025"]
["804596326"]
["804596340"]
["804596341"]
["804596342"]
["804596347"]
["804596345"]
["804596350"]
["804596801"]
["804596802"]
["804596803"]
["804596805"]
["804596808"]
["804596809"]
["804596810"]
["804596811"]
["804596812"]
["804596821"]
["803504977"]
["803504978"]
["803504984"]
["803504983"]
["803504988"]
["803504991"]
["803504997"]
["803504998"]
["803504682"]
["803504687"]
["803504690"]
["803904162"]
["803904163"]
["803904168"]
["803904171"]
["803904172"]
["803904173"]
["803904174"]
["803859134"]
["803859136"]
["803859137"]
["803859138"]
["803859140"]
["803859150"]
["804194376"]
["804240762"]
["804194381"]
["804194386"]
["804185189"]
["804194397"]
["804166195"]
["804166196"]
["804166197"]
["804166201"]
["804166202"]
["804166203"]
["804339312"]
["804166204"]
["804563218"]
["804166208"]
["804166209"]
["804166210"]
["804166215"]
["804166220"]
["804249604"]
["804249605"]
["804249606"]
["804249618"]
["804249619"]
["804249622"]
["804240752"]
["804240753"]
["804240754"]
["804249625"]
["804240755"]
["803504694"]
["803504695"]
["803504696"]
["803504697"]
["803504698"]
["803753201"]
["803753209"]
["803753210"]
["803753212"]
["803753213"]
["803753214"]
["803753223"]
["803753216"]
["803753222"]
["803577026"]
["803577028"]
["803577029"]
["803577037"]
["803577039"]
["803577040"]
["803577041"]
["803577042"]
["803577043"]
["803577044"]
["803577045"]
["803863084"]
["803863076"]
["803863080"]
["803863087"]
["803863091"]
["803863095"]
["803913213"]
["803913217"]
["803913218"]
["803913219"]
["803865938"]
["803865939"]
["803904151"]
["803904153"]
["804623576"]
["804623577"]
["804623587"]
["804822912"]
["804823388"]
["804823392"]
["805572061"]
["804998802"]
["804998803"]
["804998807"]
["804998808"]
["804998810"]
["805003926"]
["804998823"]
["805003933"]
["805003937"]
["805003945"]
["804999382"]
["805437079"]
["805437085"]
["805437098"]
["805572059"]
["805572252"]
["805526004"]
["805526011"]
["805202753"]
["805690215"]
["805712005"]
["803102155"]
["803102156"]
["803102157"]
["803102165"]
["803353374"]
["803250486"]
["803250493"]
["803250502"]
["803353301"]
["803353303"]
["803353305"]
["803353318"]
["803250494"]
["803353320"]
["803353321"]
["803250505"]
["803250515"]
["803250476"]
["803258188"]
["803250477"]
["803258187"]
["803250482"]
["803250483"]
["803250485"]
["803250489"]
["803258197"]
["803258199"]
["803258481"]
["803258482"]
["803258483"]
["803258485"]
["803147282"]
["803031569"]
["803147294"]
["803031565"]
["803147607"]
["803031572"]
["803147614"]
["803074680"]
["803074682"]
["803074683"]
["803074691"]
["803074693"]
["803074694"]
["803309428"]
["803309435"]
["803353371"]
["803309437"]
["803309440"]
["803353372"]
["803309442"]
["803102153"]
["802636491"]
["802636085"]
["802636092"]
["802636093"]
["802637429"]
["802637433"]
["802637439"]
["802637444"]
["802637445"]
["802637446"]
["802637447"]
["802664728"]
["802664729"]
["802277725"]
["802277701"]
["802277176"]
["802277185"]
["804335340"]
["804335348"]
["804339002"]
["804339006"]
["804339018"]
["804563176"]
["804339023"]
["804563179"]
["804563180"]
["804563189"]
["804563612"]
["804563618"]
["804563619"]
["804596789"]
["804596794"]
["804596796"]
["804596797"]
["804596799"]
["804596800"]
["804623001"]
["804623005"]
["804623007"]
["804623008"]
["803258751"]
["803258757"]
["803452462"]
["803477502"]
["803477504"]
["803477805"]
["803452463"]
["803477508"]
["803477513"]
["803477518"]
["803477592"]
["803477596"]
["803452451"]
["803477825"]
["803477752"]
["803452460"]
["803452468"]
["803452470"]
["803522820"]
["803522822"]
["803504427"]
["803504428"]
["803504446"]
["803913442"]
["803913445"]
["803859287"]
["803859295"]
["803859298"]
["804185161"]
["804185172"]
["804166678"]
["804185174"]
["804166531"]
["804258474"]
["804240526"]
["804240528"]
["803524251"]
["803524256"]
["803524260"]
["803524261"]
["803524264"]
["803524271"]
["803577580"]
["803577581"]
["803577584"]
["803577585"]
["803865786"]
["803577586"]
["803577587"]
["803577600"]
["803753101"]
["803753112"]
["803865784"]
["803753124"]
["803753125"]
["803577951"]
["803577953"]
["803577968"]
["803577973"]
["803880411"]
["803880412"]
["803880413"]
["803880421"]
["803888702"]
["803888717"]
["803897854"]
["803897856"]
["803897858"]
["803913704"]
["803913719"]
["803913720"]
["803913721"]
["803897988"]
["803897989"]
["803897990"]
["804596100"]
["804623205"]
["804623207"]
["804623208"]
["804623219"]
["804623220"]
["804811793"]
["804811796"]
["804811795"]
["804822778"]
["804822780"]
["804822782"]
["804822784"]
["804812306"]
["804812307"]
["804812308"]
["804812309"]
["804812311"]
["804812319"]
["804812320"]
["804812325"]
["804822790"]
["804822796"]
["804998676"]
["804998677"]
["804998678"]
["804998681"]
["804998682"]
["804998685"]
["804998686"]
["804998687"]
["804998689"]
["804998690"]
["804998693"]
["804998694"]
["805414258"]
["805414262"]
["805414268"]
["805571642"]
["805571648"]
["805265528"]
["805265531"]
["805525865"]
["805388619"]
["805389104"]
["805389110"]
["805389119"]
["805389121"]
["805525867"]
["803102858"]
["803102861"]
["803102862"]
["803309314"]
["803309315"]
["803309316"]
["803309301"]
["803309308"]
["803309318"]
["803250988"]
["803353906"]
["803353909"]
["803353910"]
["803353911"]
["803353925"]
["803250177"]
["803250184"]
["803250186"]
["803250187"]
["803250192"]
["803250195"]
["803250196"]
["803250977"]
["803250999"]
["803250978"]
["803250998"]
["803250979"]
["803250981"]
["803250983"]
["803250984"]
["803250985"]
["803250986"]
["803250991"]
["803250995"]
["803147165"]
["803147166"]
["803147172"]
["803031076"]
["803031077"]
["802930148"]
["802930149"]
["802930150"]
["803102112"]
["803102113"]
["803102114"]
["803031080"]
["803031081"]
["803031083"]
["803031090"]
["803074963"]
["803031094"]
["803074965"]
["803031097"]
["803074964"]
["803102102"]
["803102107"]
["803074960"]
["803074962"]
["803074967"]
["803074968"]
["803074969"]
["803102855"]
["802636750"]
["802636127"]
["802636136"]
["802636137"]
["802636140"]
["802636144"]
["802636147"]
["802636145"]
["802636146"]
["802636148"]
["802636149"]
["802636150"]
["802664209"]
["802664213"]
["802664217"]
["802664219"]
["802930085"]
["802664070"]
["802930091"]
["802272497"]
["802636726"]
["804249385"]
["804249304"]
["804249317"]
["804249318"]
["804249322"]
["804249323"]
["804249324"]
["804249325"]
["804339177"]
["804339181"]
["804339182"]
["804339186"]
["804339187"]
["804339189"]
["804339191"]
["804339192"]
["804339193"]
["804339199"]
["804249380"]
["804249392"]
["804249396"]
["804249397"]
["804249398"]
["804567051"]
["804567071"]
["804567075"]
["804596076"]
["804596079"]
["804567385"]
["804596082"]
["804596083"]
["804596088"]
["804602627"]
["804602632"]
["804602633"]
["804602638"]
["804602639"]
["804602640"]
["804602641"]
["804596089"]
["804602643"]
["804602644"]
["803258827"]
["803258828"]
["803258840"]
["803258841"]
["803646919"]
["803258844"]
["803258850"]
["803646904"]
["803646910"]
["803646916"]
["803646917"]
["803646918"]
["803646921"]
["803714501"]
["803714502"]
["803714503"]
["803714505"]
["803714506"]
["803714507"]
["803714508"]
["803714515"]
["803714518"]
["803714520"]
["803714521"]
["803522107"]
["803522101"]
["803522102"]
["803522104"]
["803522109"]
["803522112"]
["803522113"]
["803522114"]
["803522115"]
["803522120"]
["803504506"]
["803504509"]
["803504510"]
["803504513"]
["803504514"]
["803504512"]
["803524558"]
["803504515"]
["803504516"]
["803504520"]
["803504521"]
["803897489"]
["803897493"]
["803897495"]
["803897497"]
["803897498"]
["803897500"]
["803888431"]
["803888432"]
["803888441"]
["803888442"]
["803888443"]
["803888444"]
["803888448"]
["803873619"]
["804185805"]
["804185806"]
["804185810"]
["804185814"]
["804258078"]
["804258079"]
["804258087"]
["804258088"]
["804258094"]
["804258576"]
["804258577"]
["804240228"]
["804240229"]
["803524560"]
["803524561"]
["803524572"]
["803524573"]
["803524574"]
["803524575"]
["803754976"]
["803754978"]
["803754979"]
["803754983"]
["803754026"]
["803754984"]
["803774951"]
["803774952"]
["803774953"]
["803774956"]
["803754989"]
["803754990"]
["803754991"]
["803774961"]
["803774962"]
["803774964"]
["803774970"]
["803774971"]
["803888876"]
["803888878"]
["803888890"]
["803888893"]
["803897862"]
["803897863"]
["803897868"]
["803897869"]
["803897872"]
["803865907"]
["803865908"]
["803865909"]
["803865919"]
["803865920"]
["803865921"]
["803865922"]
["803865923"]
["803865925"]
["803897484"]
["803897485"]
["803897486"]
["803353508"]
["803353514"]
["803353516"]
["803353517"]
["803353523"]
["803353256"]
["803353263"]
["803353270"]
["803250383"]
["803250386"]
["803258029"]
["803258351"]
["803258041"]
["803258354"]
["803258355"]
["803147626"]
["803147629"]
["803147631"]
["803147643"]
["803147646"]
["803031256"]
["803074805"]
["803074806"]
["803074821"]
["803309034"]
["803309038"]
["802664990"]
["802636030"]
["802636038"]
["802636046"]
["802636050"]
["802636840"]
["802664687"]
["802664691"]
["802664692"]
["802664697"]
["802664976"]
["802664978"]
["802664992"]
["802664993"]
["802664998"]
["802930776"]
["802930784"]
["802930785"]
["802930786"]
["802930791"]
["802930796"]
["802277677"]
["802277682"]
["803646826"]
["803477008"]
["803477018"]
["803477020"]
["803522537"]
["803522546"]
["803522549"]
["803524914"]
["803524915"]
["803504364"]
["803753398"]
["803504023"]
["803577156"]
["803880190"]
["803880193"]
["803258949"]
["803258931"]
["803258937"]
["803477104"]
["803477111"]
["803477103"]
["803504226"]
["803522975"]
["803504237"]
["803504240"]
["803504242"]
["805004316"]
["802637787"]
["803102919"]
["803102920"]
["803102923"]
["803102924"]
["803102925"]
["803090652"]
["803090653"]
["803090655"]
["803090656"]
["803090657"]
["803090660"]
["803090664"]
["803090665"]
["803090666"]
["803090668"]
["803090673"]
["803090674"]
["803147051"]
["803147053"]
["803147061"]
["803147065"]
["803147068"]
["803031903"]
["803147075"]
["803031905"]
["803031906"]
["803031912"]
["803031915"]
["803031919"]
["803031920"]
["803102909"]
["803102912"]
["802930026"]
["802930027"]
["802930030"]
["802930039"]
["802930048"]
["802930049"]
["802930050"]
["802930461"]
["802930462"]
["802930464"]
["802930469"]
["802930471"]
["803452173"]
["804823111"]
["804335497"]
["804563787"]
["804602834"]
["804917251"]
["804917258"]
["804917259"]
["804917265"]
["804917267"]
["804917269"]
["804811952"]
["804811953"]
["804811960"]
["804811962"]
["804811963"]
["804811964"]
["804811965"]
["804811973"]
["804811974"]
["804812390"]
["804812395"]
["804812396"]
["804998883"]
["805413853"]
["805413854"]
["805413861"]
["805413864"]
["805413867"]
["805413870"]
["805413874"]
["805265558"]
["805265559"]
["805265560"]
["805265561"]
["805265574"]
["805389028"]
["805389034"]
["805389035"]
["805202876"]
["805202879"]
["805202880"]
["805202881"]
["805690159"]
["805690164"]
["805690165"]
["805690166"]
["803102183"]
["803102184"]
["803031621"]
["803031622"]
["803031623"]
["803102187"]
["803090588"]
["803102195"]
["803031624"]
["803353727"]
["803353728"]
["803102199"]
["803102200"]
["803090576"]
["803090577"]
["803031625"]
["803090578"]
["803353741"]
["803353742"]
["803353744"]
["803090580"]
["803090584"]
["803090585"]
["803090586"]
["803090587"]
["803353876"]
["803353887"]
["803353888"]
["803353891"]
["803353894"]
["803250232"]
["803250233"]
["803250234"]
["803250235"]
["802958851"]
["802958852"]
["803250237"]
["803250242"]
["803250243"]
["803250244"]
["803250245"]
["803258577"]
["803258578"]
["802930967"]
["803031380"]
["803147991"]
["803147208"]
["803147213"]
["803147214"]
["803147681"]
["803147686"]
["803147687"]
["803147989"]
["803147690"]
["803147976"]
["803031376"]
["802930449"]
["803031610"]
["803147983"]
["803147988"]
["803031381"]
["803031383"]
["803031386"]
["803031387"]
["803031397"]
["803074876"]
["803074877"]
["803074878"]
["803031608"]
["803074881"]
["803031611"]
["803074896"]
["803031612"]
["803102176"]
["803031614"]
["803031620"]
["803102177"]
["802664606"]
["802664393"]
["802930053"]
["802930054"]
["802930059"]
["802930430"]
["802930436"]
["802930438"]
["802930954"]
["804249694"]
["804249695"]
["804335481"]
["804335305"]
["804335312"]
["804335321"]
["804339833"]
["804339834"]
["804339835"]
["804339844"]
["804339846"]
["804339847"]
["804335325"]
["804339849"]
["804339850"]
["804335478"]
["804335480"]
["804335482"]
["804335483"]
["804563377"]
["804563376"]
["804563378"]
["804563385"]
["804563386"]
["804563387"]
["804563389"]
["804563391"]
["804563392"]
["804563394"]
["804563395"]
["804563396"]
["804563397"]
["804563776"]
["804563778"]
["804335485"]
["804335492"]
["804563779"]
["804917252"]
["802958868"]
["802958859"]
["802958875"]
["803258597"]
["803258598"]
["803258599"]
["803258600"]
["803646926"]
["803646931"]
["803646932"]
["803646933"]
["803646934"]
["803477401"]
["803646944"]
["803646945"]
["803646946"]
["803646947"]
["803477620"]
["803477621"]
["803477623"]
["803477927"]
["803477928"]
["803477929"]
["803477936"]
["803477940"]
["803477946"]
["803477950"]
["803646950"]
["803524706"]
["803524708"]
["803504476"]
["803524716"]
["803524717"]
["803524723"]
["803524724"]
["803904027"]
["803904038"]
["803859828"]
["803859843"]
["803859844"]
["803859849"]
["803859850"]
["804194788"]
["804194789"]
["804194790"]
["804194791"]
["804194797"]
["804166727"]
["804166731"]
["804166732"]
["804258292"]
["804166736"]
["804166739"]
["804166749"]
["804166750"]
["804258277"]
["804258281"]
["804258282"]
["804258283"]
["804258284"]
["804258295"]
["804258296"]
["804258297"]
["804258290"]
["804258291"]
["804249676"]
["804249678"]
["804249680"]
["804249681"]
["803504487"]
["803504488"]
["803504489"]
["803504490"]
["803504491"]
["803504492"]
["803504493"]
["803504494"]
["803504496"]
["803774076"]
["803774077"]
["803774078"]
["803774079"]
["803774082"]
["803774086"]
["803774087"]
["803774088"]
["803774096"]
["803880002"]
["803880003"]
["803880010"]
["803774097"]
["803880015"]
["803774098"]
["803774099"]
["803873731"]
["803873737"]
["803873744"]
["803873750"]
["803873977"]
["803873992"]
["803873993"]
["803873995"]
["803888483"]
["803888486"]
["803888487"]
["803888490"]
["803888491"]
["803888492"]
["803888494"]
["803888496"]
["803888499"]
["803888500"]
["804623904"]
["804623906"]
["804823342"]
["804823343"]
["804823344"]
["804823452"]
["804823463"]
["805004381"]
["805004392"]
["805004393"]
["805413584"]
["805266107"]
["805526163"]
["803090629"]
["803090630"]
["803090632"]
["803090638"]
["803090644"]
["803090649"]
["803353789"]
["803353790"]
["803353793"]
["803353794"]
["803353797"]
["803258277"]
["803258280"]
["803258281"]
["803258282"]
["803258283"]
["802930750"]
["803147305"]
["803147319"]
["803147926"]
["803147930"]
["803147937"]
["803147939"]
["803031814"]
["803031815"]
["803031822"]
["803102630"]
["803102633"]
["803102634"]
["803102635"]
["803102641"]
["802636334"]
["802636336"]
["802636339"]
["802636345"]
["802664333"]
["802664334"]
["802930742"]
["802930743"]
["802930744"]
["802930746"]
["804240314"]
["804240317"]
["804339710"]
["804339711"]
["804339447"]
["804339450"]
["804339715"]
["804339716"]
["804240625"]
["804339722"]
["804339723"]
["804339725"]
["804563026"]
["804563040"]
["804563043"]
["804563044"]
["804563046"]
["804563047"]
["804596126"]
["804596143"]
["804596144"]
["804596150"]
["804623902"]
["803258290"]
["803258291"]
["803258293"]
["803258294"]
["803646201"]
["803646452"]
["803646459"]
["803646466"]
["803452494"]
["803452495"]
["803522751"]
["803522761"]
["803522486"]
["803522491"]
["803522499"]
["803522500"]
["803866000"]
["803904404"]
["803859632"]
["803859639"]
["804194218"]
["804194222"]
["804185983"]
["804185984"]
["804185992"]
["804185993"]
["804194732"]
["804194748"]
["804194749"]
["804258165"]
["804258166"]
["804258167"]
["804240601"]
["804240308"]
["803524038"]
["803524039"]
["803753314"]
["803753325"]
["803753802"]
["803753811"]
["803753812"]
["803753813"]
["803753814"]
["803753816"]
["803753824"]
["803852661"]
["803852667"]
["803865402"]
["803865407"]
["803865408"]
["803865409"]
["803865410"]
["803865411"]
["803913131"]
["803913142"]
["804623264"]
["804623266"]
["804623267"]
["804916714"]
["804916719"]
["804811926"]
["804811931"]
["804811932"]
["804811936"]
["804811942"]
["804823108"]
["804823122"]
["804823123"]
["804823124"]
["805004319"]
["805413837"]
["805413839"]
["805413826"]
["805413834"]
["805413835"]
["805413844"]
["805412405"]
["805412407"]
["805412409"]
["805571693"]
["805412126"]
["805412127"]
["805571697"]
["805412129"]
["805412130"]
["805412135"]
["805412139"]
["805265607"]
["805265615"]
["805265622"]
["805389077"]
["805389080"]
["805389085"]
["805389089"]
["805389090"]
["805389091"]
["805389092"]
["805389097"]
["805389099"]
["805525877"]
["805525878"]
["805525899"]
["805525886"]
["805525889"]
["805203301"]
["805203302"]
["805203325"]
["804335852"]
["804335856"]
["804335864"]
["804339581"]
["804339599"]
["804339987"]
["804339988"]
["804339989"]
["804563363"]
["804563371"]
["804563372"]
["804563374"]
["804563407"]
["804563410"]
["804563412"]
["804563413"]
["804563414"]
["804563423"]
["804563556"]
["804563567"]
["804563568"]
["804563569"]
["804602252"]
["804602261"]
["804602262"]
["804602263"]
["804602270"]
["804602273"]
["804596502"]
["804602274"]
["804602275"]
["804596501"]
["804596513"]
["804596514"]
["804194634"]
["804194635"]
["804194756"]
["804194649"]
["804194752"]
["804194762"]
["804194769"]
["804185425"]
["804194773"]
["804249004"]
["804249005"]
["804249011"]
["804249012"]
["804249017"]
["804249151"]
["804249152"]
["804249155"]
["804249160"]
["804249170"]
["803395876"]
["803395889"]
["803865763"]
["803353184"]
["803353192"]
["803353186"]
["803353189"]
["803353190"]
["803353191"]
["803353198"]
["803353199"]
["803353200"]
["803250676"]
["803250678"]
["803250684"]
["803250690"]
["803250692"]
["803147538"]
["803031688"]
["803031695"]
["803031697"]
["803074726"]
["803074732"]
["803074741"]
["803102890"]
["803102892"]
["802664267"]
["802664275"]
["802664468"]
["802664471"]
["802664473"]
["802664509"]
["802930369"]
["803258475"]
["803452854"]
["803452855"]
["803452856"]
["803452857"]
["803452858"]
["803452859"]
["803452869"]
["803452874"]
["803477058"]
["804596848"]
["804563146"]
["804822752"]
["804822753"]
["804811935"]
["804986483"]
["804986490"]
["805004451"]
["804986495"]
["805004452"]
["805004453"]
["805004454"]
["805004455"]
["805004456"]
["805004458"]
["805004459"]
["804240175"]
["804335201"]
["804335202"]
["804335203"]
["804335209"]
["804335213"]
["804335221"]
["804335223"]
["804339082"]
["804339083"]
["804335701"]
["804339089"]
["804563143"]
["804339091"]
["804339092"]
["804339094"]
["804339095"]
["804339096"]
["804339097"]
["804339100"]
["804335717"]
["804335718"]
["804335725"]
["804249136"]
["804249144"]
["803859862"]
["804194270"]
["804166058"]
["804166071"]
["804166075"]
["804166402"]
["804166405"]
["804166415"]
["804166417"]
["804166666"]
["804166668"]
["804240152"]
["804240155"]
["804240156"]
["804240162"]
["804240164"]
["804240165"]
["803913977"]
["803913978"]
["803913983"]
["803913985"]
["803913986"]
["803914000"]
["803888332"]
["805003739"]
["804623186"]
["804623187"]
["804917277"]
["804623192"]
["804811551"]
["804623197"]
["804822569"]
["804811560"]
["804822571"]
["804822572"]
["804999227"]
["804999228"]
["804999229"]
["804986354"]
["804999241"]
["804986364"]
["805414028"]
["805414039"]
["805571954"]
["805571955"]
["805414037"]
["805414038"]
["805571957"]
["805388802"]
["803102226"]
["803102227"]
["803102236"]
["803102242"]
["803102243"]
["803102245"]
["803102244"]
["803102246"]
["803102247"]
["803353527"]
["803353528"]
["803353531"]
["803353533"]
["803258635"]
["803353456"]
["803353990"]
["803353991"]
["803353459"]
["803258636"]
["803353464"]
["803102955"]
["803353993"]
["803353472"]
["803258630"]
["803258631"]
["803258632"]
["803258633"]
["803258634"]
["802930263"]
["802930928"]
["802930944"]
["803031645"]
["803147832"]
["803147849"]
["803031630"]
["803031635"]
["803031637"]
["803102564"]
["803102565"]
["803102568"]
["803074554"]
["803074555"]
["803309062"]
["802664863"]
["802664874"]
["802930024"]
["804166591"]
["804194893"]
["804194897"]
["804335888"]
["804335891"]
["804335898"]
["804258522"]
["804258921"]
["804258922"]
["804258524"]
["804258525"]
["804335601"]
["804335602"]
["804335606"]
["804335607"]
["804335611"]
["804335612"]
["804335618"]
["804335621"]
["804569728"]
["804567857"]
["804567870"]
["804569727"]
["804569759"]
["804569736"]
["804569744"]
["804569746"]
["804569747"]
["804569748"]
["804569762"]
["804623181"]
["804623182"]
["803258637"]
["803258640"]
["803646651"]
["803258624"]
["803646665"]
["803646666"]
["803646669"]
["803646670"]
["803646672"]
["803646673"]
["803451076"]
["803646675"]
["803451622"]
["803452338"]
["803452339"]
["803452340"]
["803452341"]
["803753466"]
["803451085"]
["803451088"]
["803504001"]
["803452770"]
["803524226"]
["803451089"]
["803451090"]
["803524245"]
["803524246"]
["804258512"]
["804258513"]
["803859485"]
["803888540"]
["803888550"]
["804194876"]
["804194915"]
["804194917"]
["803913598"]
["804166578"]
["804166579"]
["804194878"]
["804166596"]
["804166599"]
["804258509"]
["804258510"]
["804258511"]
["803504003"]
["803504006"]
["803452773"]
["803452774"]
["803452775"]
["803753451"]
["803753456"]
["803753457"]
["803753461"]
["803753464"]
["803753465"]
["803753473"]
["803753475"]
["804602392"]
["804917167"]
["804823278"]
["804823279"]
["804823288"]
["804823292"]
["804823295"]
["804823298"]
["804823300"]
["805003703"]
["805003704"]
["805003722"]
["805003723"]
["805003727"]
["805003731"]
["805003732"]
["805003736"]
["805003737"]
["805003738"]
["805003740"]
["805003743"]
["805003744"]
["805413978"]
["805413982"]
["805413983"]
["805413997"]
["805413951"]
["805413954"]
["805413955"]
["805413970"]
["805572239"]
["805266216"]
["805266218"]
["805266220"]
["805266225"]
["805526213"]
["805526223"]
["803074917"]
["803309204"]
["803309205"]
["803309212"]
["803309213"]
["803309224"]
["803353332"]
["803353334"]
["803353338"]
["803353344"]
["803353342"]
["803250201"]
["803353349"]
["803250212"]
["803250214"]
["803250221"]
["803250879"]
["803250889"]
["803250891"]
["803250893"]
["803250897"]
["803250898"]
["803250284"]
["803250285"]
["803250287"]
["803250289"]
["803250290"]
["803250291"]
["803250292"]
["803031781"]
["803147042"]
["803147049"]
["803031782"]
["803147485"]
["803031783"]
["803147488"]
["803031034"]
["803031038"]
["803031041"]
["803031042"]
["803031784"]
["803031798"]
["803031855"]
["803031856"]
["803031857"]
["803031858"]
["803031861"]
["803031862"]
["803031863"]
["803031864"]
["803031865"]
["803031866"]
["803031874"]
["803309076"]
["803309077"]
["803309090"]
["803309091"]
["803309098"]
["803309477"]
["803309494"]
["803309498"]
["803074903"]
["803074904"]
["802664577"]
["802664589"]
["802664590"]
["802930177"]
["802930184"]
["802930188"]
["802930196"]
["804240127"]
["804240128"]
["804240129"]
["804240142"]
["804240144"]
["804240145"]
["804240146"]
["804339327"]
["804339328"]
["804623647"]
["804623648"]
["804339334"]
["804339336"]
["804339337"]
["804240283"]
["804240284"]
["804240287"]
["804240289"]
["804240290"]
["804240291"]
["804240295"]
["804240298"]
["804240299"]
["804563830"]
["804563849"]
["804563753"]
["804563756"]
["804563757"]
["804563763"]
["804602379"]
["804602380"]
["804602381"]
["804602384"]
["804602390"]
["803258956"]
["803258958"]
["803258852"]
["803258858"]
["803258868"]
["803258869"]
["803477332"]
["803477343"]
["803477344"]
["803477349"]
["803477350"]
["803714052"]
["803714055"]
["803714056"]
["803714057"]
["803714061"]
["803714070"]
["803714071"]
["803714073"]
["803714074"]
["803452417"]
["803524926"]
["803524929"]
["803524933"]
["803524942"]
["803524952"]
["803904121"]
["803888414"]
["803888416"]
["803888423"]
["803859169"]
["804185678"]
["804185684"]
["804185688"]
["804185689"]
["804185691"]
["804185699"]
["804194426"]
["804194430"]
["804194437"]
["804194438"]
["804194440"]
["804194444"]
["804194445"]
["804339343"]
["804194449"]
["804194450"]
["804258226"]
["804258228"]
["804258230"]
["804258234"]
["804258243"]
["804258247"]
["804258248"]
["804240459"]
["804240460"]
["804240466"]
["804240467"]
["804240469"]
["803524961"]
["803524962"]
["803753433"]
["803753676"]
["803753439"]
["803753440"]
["803753442"]
["803753444"]
["803753449"]
["803753450"]
["803753689"]
["803753691"]
["803753695"]
["803753699"]
["803863212"]
["803897613"]
["803897614"]
["803897616"]
["804185692"]
["803888415"]
["803913776"]
["803859152"]
["803904105"]
["803904106"]
["803904107"]
["803309125"]
["803102983"]
["803102985"]
["803102993"]
["803309227"]
["803309230"]
["803309233"]
["803309234"]
["803309235"]
["803309237"]
["803309245"]
["803309249"]
["803353077"]
["803353089"]
["803353083"]
["803353091"]
["803353652"]
["803353672"]
["803353674"]
["803250777"]
["803250778"]
["803250784"]
["803250787"]
["803250792"]
["803031477"]
["803147196"]
["803147863"]
["803309110"]
["803031830"]
["803031831"]
["803031833"]
["803031842"]
["803031848"]
["803031849"]
["803309107"]
["803309109"]
["803309112"]
["803309113"]
["803309111"]
["803309120"]
["803309124"]
["802664730"]
["802664733"]
["802664734"]
["802664741"]
["802664745"]
["803250797"]
["803250799"]
["803646147"]
["803452961"]
["803452962"]
["803452963"]
["803452967"]
["803452968"]
["803477028"]
["803477029"]
["803477038"]
["803477041"]
["803522504"]
["803522509"]
["803522511"]
["803522515"]
["803522519"]
["803522521"]
["803522522"]
["803524811"]
["803524812"]
["803524814"]
["803524815"]
["803524816"]
["803524817"]
["803524452"]
["803524453"]
["803524824"]
["803524825"]
["803524101"]
["803524102"]
["803524103"]
["803524104"]
["803524105"]
["803524106"]
["803524107"]
["803524108"]
["803524109"]
["803524116"]
["803524117"]
["803524051"]
["803524052"]
["803524123"]
["803524124"]
["803524055"]
["803524125"]
["803524059"]
["803524065"]
["803524068"]
["803524069"]
["803524070"]
["803524471"]
["803524472"]
["803880126"]
["803880134"]
["803880138"]
["803880139"]
["803880142"]
["803897634"]
["803897635"]
["803897636"]
["803897637"]
["803504915"]
["803897639"]
["803897807"]
["803897815"]
["805411715"]
["803045301"]
["804623680"]
["804623681"]
["804623683"]
["804917235"]
["804917248"]
["804811836"]
["804811837"]
["804811840"]
["804811847"]
["804822612"]
["804822617"]
["804812291"]
["804812296"]
["804812298"]
["805004127"]
["805004136"]
["805004148"]
["805004149"]
["805004160"]
["805004161"]
["805004163"]
["805004165"]
["805004170"]
["804241000"]
["804249437"]
["804602893"]
["804339915"]
["804335278"]
["804335284"]
["804335285"]
["804563484"]
["804563497"]
["804822602"]
["804567038"]
["804567039"]
["804602041"]
["804602043"]
["804822603"]
["804596207"]
["804602746"]
["804602885"]
["803913458"]
["804194577"]
["804194587"]
["804194588"]
["804194716"]
["804194719"]
["804258180"]
["804258780"]
["804258782"]
["804258676"]
["804240998"]
["804249426"]
["803897730"]
["803897743"]
["803897749"]
["803913855"]
["803888526"]
["803753287"]
["804258422"]
["804194151"]
["804194387"]
["804602474"]
["804822815"]
["804602065"]
["804602067"]
["804822825"]
["804823404"]
["804823412"]
["804823416"]
["804823422"]
["804823423"]
["804823424"]
["805004180"]
["805004184"]
["805004186"]
["805004191"]
["805004192"]
["805004193"]
["805004194"]
["805004195"]
["805004198"]
["805004199"]
["805004200"]
["804998853"]
["804998857"]
["805414497"]
["805414498"]
["805414500"]
["805414287"]
["804240359"]
["804335251"]
["804335253"]
["804335256"]
["804335257"]
["804335272"]
["804339284"]
["804339290"]
["804339291"]
["804339292"]
["804339298"]
["804339300"]
["804563327"]
["804563329"]
["804563337"]
["804563342"]
["804567403"]
["804567404"]
["804567405"]
["804567406"]
["804567414"]
["804567415"]
["804567417"]
["804567420"]
["804567421"]
["804567424"]
["804602053"]
["804602058"]
["804602059"]
["804602451"]
["804194153"]
["804166518"]
["804194156"]
["804194163"]
["804194165"]
["804185226"]
["804335273"]
["804185232"]
["804185236"]
["804339289"]
["804185242"]
["804339288"]
["804194173"]
["804194174"]
["804166501"]
["804166502"]
["804563331"]
["804166507"]
["804194960"]
["804194969"]
["804194970"]
["804166515"]
["804166517"]
["804166520"]
["804166521"]
["803896596"]
["803896597"]
["803504945"]
["803309792"]
["803309794"]
["803309795"]
["803309797"]
["803147901"]
["803147915"]
["803031428"]
["803031431"]
["803031432"]
["803031438"]
["803102820"]
["805571972"]
["804028107"]
["804812218"]
["804623938"]
["804623940"]
["804623941"]
["804623942"]
["804623943"]
["804623944"]
["804623945"]
["804623946"]
["804623947"]
["804623948"]
["804623949"]
["804623950"]
["804916851"]
["804916852"]
["804916853"]
["804916854"]
["804916855"]
["804916856"]
["804916858"]
["804916859"]
["804916860"]
["804916861"]
["804916867"]
["804916869"]
["804916870"]
["804916871"]
["804916872"]
["804916873"]
["804812204"]
["804812205"]
["804812206"]
["804812207"]
["804812212"]
["804812213"]
["804812214"]
["804812215"]
["804812216"]
["804812221"]
["804812222"]
["804812223"]
["804812224"]
["804812225"]
["804812157"]
["804812161"]
["804812163"]
["804812164"]
["804812165"]
["804812166"]
["804812167"]
["804812168"]
["804812169"]
["804823441"]
["804823442"]
["805003953"]
["805003954"]
["805003955"]
["805003956"]
["805003957"]
["805003958"]
["805003974"]
["805003960"]
["804999325"]
["805003963"]
["805003967"]
["805003973"]
["804999327"]
["805414351"]
["805414353"]
["805414359"]
["804999329"]
["805265761"]
["803031285"]
["804240863"]
["804240864"]
["804240875"]
["804335376"]
["804335377"]
["804335391"]
["804335392"]
["804335682"]
["804335684"]
["804335685"]
["804335686"]
["804335687"]
["804335688"]
["804335689"]
["804335690"]
["804335692"]
["804335693"]
["804335694"]
["804335698"]
["804335700"]
["804563151"]
["804563157"]
["804563158"]
["804563159"]
["804563160"]
["804563162"]
["804563163"]
["804563164"]
["804563166"]
["804563167"]
["804563168"]
["804563169"]
["804563170"]
["804563171"]
["804563172"]
["804563173"]
["804563175"]
["804567601"]
["804567602"]
["804567605"]
["804567608"]
["804567606"]
["804567607"]
["804567610"]
["804567611"]
["804567612"]
["804567614"]
["804567615"]
["804567616"]
["804567617"]
["804567618"]
["804567619"]
["804567622"]
["804567623"]
["804567624"]
["804567625"]
["804567377"]
["804567378"]
["804567382"]
["804567386"]
["804567387"]
["804567389"]
["804567390"]
["804567391"]
["804567392"]
["804567393"]
["804567395"]
["804567396"]
["804567397"]
["804567399"]
["804567400"]
["804596527"]
["804596529"]
["804596530"]
["804596531"]
["804596532"]
["804596533"]
["804596534"]
["804596535"]
["804596536"]
["804596537"]
["804596538"]
["804596539"]
["804596540"]
["804596541"]
["804596542"]
["804596543"]
["804596544"]
["804596545"]
["804596546"]
["804596547"]
["804596549"]
["804596851"]
["804596550"]
["804596854"]
["804596855"]
["804596856"]
["804596857"]
["804596858"]
["804596859"]
["804596860"]
["804596861"]
["804596862"]
["804596863"]
["804596864"]
["804596866"]
["804596867"]
["804596868"]
["804596869"]
["804596870"]
["804596872"]
["804596873"]
["804596874"]
["804563102"]
["804563103"]
["804563104"]
["804596875"]
["804563105"]
["804563106"]
["804563107"]
["804563108"]
["804563109"]
["804563111"]
["804563112"]
["804563119"]
["804563120"]
["803877051"]
["803877052"]
["803877053"]
["803877059"]
["803877068"]
["804194276"]
["804194277"]
["804194278"]
["804194280"]
["803904069"]
["803904070"]
["803904071"]
["804194286"]
["804194287"]
["804194288"]
["804194289"]
["804194291"]
["804194299"]
["804194300"]
["804185103"]
["804185104"]
["804185105"]
["804185106"]
["804185107"]
["804185120"]
["804185119"]
["804185123"]
["804185124"]
["804185122"]
["804185125"]
["804166602"]
["804166603"]
["804166605"]
["804166618"]
["804240851"]
["804240855"]
["804240856"]
["803913504"]
["803913505"]
["803913517"]
["803913521"]
["804623286"]
["804623294"]
["804916802"]
["804916820"]
["804916824"]
["804822957"]
["804822958"]
["804822964"]
["805004351"]
["805004352"]
["805004366"]
["805004370"]
["805412452"]
["805412454"]
["805572481"]
["805389151"]
["805389152"]
["805389154"]
["805389167"]
["805388685"]
["805388686"]
["804335402"]
["804335403"]
["804335404"]
["804335405"]
["804335418"]
["804335420"]
["804335421"]
["804335422"]
["804567556"]
["804567559"]
["804567571"]
["804567574"]
["804602407"]
["804602409"]
["804602411"]
["804623276"]
["804623281"]
["804194676"]
["804194685"]
["804194639"]
["804194693"]
["804194698"]
["804194700"]
["804166258"]
["804166260"]
["804166261"]
["804166262"]
["804249030"]
["804249032"]
["804249041"]
["804240662"]
["804249049"]
["804240664"]
["804567570"]
["804623370"]
["804623969"]
["804823232"]
["804823491"]
["804822349"]
["805003981"]
["805003982"]
["805003986"]
["804999287"]
["805414463"]
["805414205"]
["805414217"]
["805572414"]
["805572412"]
["805526033"]
["805526050"]
["805389073"]
["805525587"]
["805525593"]
["805202816"]
["805203211"]
["804249952"]
["804339851"]
["804339853"]
["804339893"]
["804339894"]
["804339896"]
["804339897"]
["804339899"]
["804335655"]
["804335662"]
["804563690"]
["804596703"]
["804596704"]
["804596955"]
["804596962"]
["804596963"]
["805266035"]
["805525947"]
["805411726"]
["805571726"]
["805571732"]
["805571734"]
["805571737"]
["805571738"]
["805571740"]
["805571741"]
["805571744"]
["805389401"]
["805571748"]
["805571749"]
["805389404"]
["805389409"]
["805389410"]
["805389412"]
["805389418"]
["805389419"]
["803090523"]
["803102379"]
["803102380"]
["803102400"]
["803090508"]
["803090509"]
["803090511"]
["803090520"]
["803090524"]
["803353151"]
["803258622"]
["803258623"]
["803353160"]
["803353161"]
["803353164"]
["803353165"]
["803353166"]
["803353702"]
["803250001"]
["803353858"]
["803250020"]
["803250023"]
["803353663"]
["803250926"]
["803250927"]
["803250929"]
["803250930"]
["803250936"]
["803250938"]
["803250943"]
["803250946"]
["803258604"]
["803102833"]
["803102838"]
["803102839"]
["803102844"]
["803646168"]
["803646173"]
["803646330"]
["803646331"]
["803646333"]
["803646334"]
["803646833"]
["803646337"]
["803646342"]
["803646728"]
["803451520"]
["803646746"]
["803646747"]
["803646344"]
["803646749"]
["803646750"]
["803646347"]
["803646348"]
["803451577"]
["803451578"]
["803451519"]
["803522633"]
["803522652"]
["803522653"]
["803522659"]
["803522660"]
["803522661"]
["803522664"]
["803522667"]
["803522646"]
["803522384"]
["803522672"]
["803522673"]
["803522395"]
["803522399"]
["803524302"]
["803904058"]
["803904286"]
["803873572"]
["803873573"]
["803904294"]
["804249632"]
["804185004"]
["804185006"]
["804185008"]
["804185552"]
["804185555"]
["804249630"]
["804249626"]
["804185563"]
["804185566"]
["804185567"]
["804185568"]
["804185569"]
["804185575"]
["804249635"]
["804249095"]
["803524310"]
["803524312"]
["803524323"]
["803753764"]
["803753768"]
["803577016"]
["803880179"]
["803880161"]
["803865583"]
["803865286"]
["803865288"]
["803865584"]
["803865585"]
["803865586"]
["803865593"]
["803865531"]
["803865533"]
["803873665"]
["803873552"]
["803102362"]
["803102363"]
["803102366"]
["803102373"]
["803353144"]
["803353145"]
["803353147"]
["803353226"]
["803353235"]
["803353237"]
["803353242"]
["803250076"]
["803250080"]
["803250083"]
["803250084"]
["803250085"]
["803250087"]
["803250088"]
["803250090"]
["803250093"]
["803250094"]
["803250095"]
["803250096"]
["803250097"]
["803250100"]
["803250706"]
["803250707"]
["803250712"]
["803309886"]
["803309892"]
["803353231"]
["803309895"]
["803646548"]
["803646866"]
["803646867"]
["803452252"]
["803452271"]
["803452272"]
["803714039"]
["803714028"]
["803452321"]
["803452323"]
["803522739"]
["803504333"]
["803888374"]
["803859971"]
["803859972"]
["803859973"]
["803859975"]
["804185261"]
["804185266"]
["804185271"]
["804185272"]
["804185275"]
["803504335"]
["803504349"]
["803577126"]
["803577137"]
["803774052"]
["803774056"]
["803774069"]
["803873779"]
["803897881"]
["803888361"]
["803888362"]
["803888367"]
["803888368"]
["803102329"]
["803102330"]
["803102331"]
["803102334"]
["803102335"]
["803102336"]
["803309138"]
["803309140"]
["803102350"]
["803353402"]
["803353407"]
["803353412"]
["803309130"]
["803309139"]
["803309134"]
["803309142"]
["803309145"]
["803353479"]
["803353481"]
["803353499"]
["803250060"]
["803250061"]
["803250066"]
["803250344"]
["803250348"]
["803250827"]
["803250830"]
["803250839"]
["803250844"]
["803250845"]
["803250849"]
["802958839"]
["802958847"]
["802958848"]
["802958849"]
["803258777"]
["803646510"]
["803646064"]
["803646374"]
["803452677"]
["803452693"]
["803452694"]
["803452697"]
["803477313"]
["803477322"]
["803522032"]
["803504785"]
["803504561"]
["803904392"]
["803904393"]
["803904399"]
["803873468"]
["803873469"]
["803873340"]
["804166907"]
["803504572"]
["803504573"]
["803565880"]
["803753127"]
["803753128"]
["803753139"]
["803880088"]
["803880095"]
["803880096"]
["803880097"]
["803865344"]
["803865345"]
["803865346"]
["803865347"]
["803888190"]
["803888191"]
["803888192"]
["803913937"]
["803913803"]
["803865867"]
["803904376"]
["803353433"]
["803353431"]
["803353432"]
["803353436"]
["803353443"]
["803353445"]
["803353446"]
["803353447"]
["803353210"]
["803353222"]
["803353223"]
["803353224"]
["803353225"]
["803250030"]
["803250040"]
["803250627"]
["803250451"]
["803250633"]
["803250637"]
["803250638"]
["803250647"]
["803250648"]
["803250952"]
["803250953"]
["803250954"]
["803250970"]
["803258701"]
["803258702"]
["803258707"]
["803258713"]
["803258385"]
["803258397"]
["803258400"]
["803258985"]
["803258990"]
["803258883"]
["803258884"]
["803258889"]
["803258899"]
["803258906"]
["803258911"]
["803477712"]
["803477702"]
["803477703"]
["803477704"]
["803477708"]
["803477710"]
["803477711"]
["803477716"]
["803477723"]
["803477724"]
["803504726"]
["803504727"]
["803504576"]
["803504584"]
["803504589"]
["803504590"]
["803504594"]
["803504595"]
["803504598"]
["803504731"]
["803504732"]
["803913491"]
["803913492"]
["803859336"]
["804185839"]
["804185842"]
["804185843"]
["804185844"]
["804185845"]
["804185539"]
["804185542"]
["804194855"]
["804194857"]
["804194858"]
["804194863"]
["804194864"]
["804194866"]
["804194867"]
["804194868"]
["804194869"]
["804258304"]
["804258311"]
["804258312"]
["803504735"]
["803504745"]
["803753708"]
["803753709"]
["803577061"]
["803774939"]
["803774940"]
["803774942"]
["803873292"]
["803865568"]
["803888380"]
["803888381"]
["803888384"]
["803888392"]
["803888399"]
["803888400"]
["803897376"]
["803897380"]
["803897389"]
["803897397"]
["803897399"]
["803897437"]
["803897439"]
["803897443"]
["803888598"]
["803913477"]
["804623319"]
["804623321"]
["804623322"]
["804623324"]
["804596555"]
["804596557"]
["804811801"]
["804811809"]
["804811810"]
["804811811"]
["804811818"]
["804811819"]
["804811821"]
["804812039"]
["804812040"]
["804812041"]
["804812042"]
["804812045"]
["804812046"]
["804812047"]
["804812048"]
["804812050"]
["804811637"]
["804811638"]
["804811639"]
["805003858"]
["805003859"]
["804249844"]
["804249847"]
["804249848"]
["804249849"]
["804249850"]
["804335954"]
["804335955"]
["804335185"]
["804335195"]
["804335197"]
["804335198"]
["804596428"]
["804596429"]
["804596431"]
["804596437"]
["804596438"]
["804596153"]
["804596883"]
["804596885"]
["804596886"]
["804596887"]
["804596888"]
["804596892"]
["804596898"]
["804596899"]
["804240854"]
["804249829"]
["804249832"]
["804916926"]
["804917001"]
["804636248"]
["804811726"]
["804811734"]
["804985930"]
["804985931"]
["804985939"]
["804985941"]
["805004226"]
["805004228"]
["805004232"]
["805004242"]
["805004243"]
["803090283"]
["803090285"]
["803090295"]
["803090296"]
["803250526"]
["803258303"]
["803250533"]
["803258268"]
["803646001"]
["803250534"]
["803250547"]
["803258269"]
["803250548"]
["803258321"]
["803258323"]
["803258324"]
["803258325"]
["804166648"]
["804166650"]
["804339031"]
["804339032"]
["804240646"]
["804240648"]
["804240649"]
["804240650"]
["804567704"]
["804567707"]
["804339033"]
["804567508"]
["804567509"]
["804339046"]
["804165322"]
["804623201"]
["804623203"]
["803250762"]
["803258257"]
["803646777"]
["803646783"]
["803477156"]
["803477160"]
["803477165"]
["803477166"]
["803477167"]
["803717892"]
["803717893"]
["803717891"]
["803717898"]
["803522887"]
["803522893"]
["803522894"]
["803504754"]
["803504758"]
["803504759"]
["803504760"]
["803504766"]
["803504767"]
["803504769"]
["803504775"]
["803524326"]
["803524327"]
["803873609"]
["803873611"]
["803873612"]
["803605266"]
["803605271"]
["803605274"]
["804185476"]
["804185477"]
["804185480"]
["804185277"]
["804185278"]
["804258909"]
["804258910"]
["804258912"]
["804258913"]
["804166640"]
["804166641"]
["803524328"]
["803524329"]
["803524330"]
["803524333"]
["803524334"]
["803565827"]
["803524337"]
["803524338"]
["803565828"]
["803565829"]
["803565830"]
["803565831"]
["803524340"]
["803524343"]
["803524347"]
["803753978"]
["803507308"]
["803753979"]
["803865310"]
["803865311"]
["803865313"]
["803507311"]
["803888551"]
["803310321"]
["803353626"]
["803353631"]
["803353637"]
["803250435"]
["803250437"]
["803250439"]
["803250440"]
["802958780"]
["802958781"]
["802958782"]
["802958790"]
["802958791"]
["802958792"]
["802958794"]
["802958796"]
["803258076"]
["803258080"]
["803258092"]
["803258094"]
["803258098"]
["803258099"]
["803258100"]
["803258733"]
["803258744"]
["803646479"]
["803646483"]
["803646499"]
["803452201"]
["803452203"]
["803452204"]
["803452206"]
["803452207"]
["803452210"]
["803452211"]
["803452220"]
["803452223"]
["803452224"]
["803714555"]
["803522854"]
["803522855"]
["803522856"]
["803522862"]
["803522863"]
["803522864"]
["803452300"]
["803522868"]
["803522869"]
["803522870"]
["803522874"]
["803522402"]
["803522875"]
["803522404"]
["803522408"]
["803522409"]
["803522410"]
["803522411"]
["803522414"]
["803522415"]
["803522416"]
["803504101"]
["803504110"]
["803504111"]
["803524126"]
["803524127"]
["803504115"]
["803504116"]
["803888651"]
["803888656"]
["803859746"]
["803888661"]
["803888673"]
["803859733"]
["803859737"]
["803859738"]
["803859739"]
["803859740"]
["803859742"]
["803859745"]
["803524135"]
["803504121"]
["803504122"]
["803504123"]
["803524136"]
["803524137"]
["803524138"]
["803524139"]
["803524140"]
["803524141"]
["803524142"]
["803524148"]
["803524149"]
["803524144"]
["803524147"]
["803524150"]
["803577078"]
["803577079"]
["803577080"]
["803577081"]
["803577082"]
["803577086"]
["803577087"]
["803577088"]
["803577095"]
["803577097"]
["803577976"]
["803577979"]
["803577981"]
["803577986"]
["803577987"]
["803577992"]
["803577988"]
["803577991"]
["803577984"]
["803577985"]
["803577993"]
["803577994"]
["803577997"]
["803577998"]
["803577999"]
["803880203"]
["803880204"]
["803880206"]
["803880207"]
["803880209"]
["803880210"]
["803880222"]
["803880213"]
["803880214"]
["803880218"]
["803880071"]
["803880224"]
["803873851"]
["803873853"]
["803873862"]
["803873863"]
["803873868"]
["803873869"]
["803873870"]
["803873871"]
["803897576"]
["803897577"]
["803897581"]
["803897582"]
["803897584"]
["803897586"]
["803897589"]
["803897583"]
["803897592"]
["803897593"]
["803897594"]
["803897596"]
["803863044"]
["803865676"]
["803865684"]
["803865682"]
["803865690"]
["803865692"]
["803873968"]
["803865696"]
["803865698"]
["803888410"]
["803888411"]
["803888412"]
["803250741"]
["803250818"]
["803250820"]
["803250823"]
["803250824"]
["804194808"]
["804194809"]
["804194811"]
["804194819"]
["804194820"]
["804194822"]
["804258005"]
["804240279"]
["803258810"]
["803258822"]
["803258824"]
["803646890"]
["803646891"]
["803646892"]
["803646893"]
["803646900"]
["803646961"]
["803646962"]
["803477915"]
["803477923"]
["803477924"]
["803477777"]
["803477779"]
["803477800"]
["803524752"]
["803524753"]
["803524877"]
["803524888"]
["803524889"]
["803524890"]
["803524893"]
["803524894"]
["803524895"]
["803888976"]
["803888950"]
["803888986"]
["803888987"]
["803888989"]
["803888990"]
["803888601"]
["803888602"]
["803888604"]
["803888605"]
["803863169"]
["804194126"]
["803863170"]
["803863171"]
["804194142"]
["804194143"]
["804194137"]
["804194140"]
["804185078"]
["804185076"]
["804185077"]
["803565840"]
["804194801"]
["804185096"]
["804185099"]
["804185100"]
["804258552"]
["804249186"]
["804249187"]
["804249191"]
["804249196"]
["804194803"]
["804240276"]
["804249199"]
["804249200"]
["804249376"]
["804249377"]
["804249378"]
["803524898"]
["803524899"]
["803524413"]
["803524414"]
["803524417"]
["803504304"]
["803504305"]
["803504312"]
["803504313"]
["803888936"]
["803504321"]
["803504322"]
["803504323"]
["803753877"]
["803753900"]
["803873813"]
["803873814"]
["803873816"]
["803873818"]
["803888301"]
["803888302"]
["803888303"]
["803888304"]
["803888319"]
["803888322"]
["803888323"]
["803888321"]
["803888126"]
["803888127"]
["803888128"]
["804194141"]
["803888136"]
["803888137"]
["803888142"]
["803888143"]
["803888144"]
["803888938"]
["803888939"]
["803888941"]
["804569873"]
["804569874"]
["804551324"]
["804916765"]
["804916772"]
["804823268"]
["804998902"]
["804998920"]
["805572352"]
["805003681"]
["805413815"]
["805503531"]
["804623843"]
["804916886"]
["804812192"]
["804812196"]
["804812200"]
["804999183"]
["804999184"]
["804999185"]
["804999199"]
["805413901"]
["805413909"]
["805413921"]
["805571528"]
["805571529"]
["805571530"]
["805572129"]
["805572130"]
["805572133"]
["805572134"]
["805572135"]
["805572136"]
["805572142"]
["805572301"]
["805572306"]
["805572321"]
["805572322"]
["805572323"]
["805572325"]
["805265964"]
["805265975"]
["805389176"]
["805389184"]
["805389185"]
["805526486"]
["805526487"]
["805526491"]
["805526496"]
["805526497"]
["805526499"]
["805526500"]
["805690280"]
["804567439"]
["804596691"]
["804596692"]
["804602234"]
["804602429"]
["804602432"]
["804602433"]
["804596967"]
["804596969"]
["804917113"]
["804917117"]
["804811758"]
["804811770"]
["804812118"]
["804986332"]
["804986333"]
["804986331"]
["804986334"]
["804986335"]
["805003781"]
["805003789"]
["805003787"]
["805411758"]
["805414431"]
["804986338"]
["804986339"]
["805411761"]
["804240746"]
["804240748"]
["804240251"]
["804240253"]
["804240254"]
["804240261"]
["804240263"]
["804240265"]
["804240267"]
["804240274"]
["804240275"]
["804335524"]
["803897783"]
["804563735"]
["804563737"]
["804563738"]
["804563743"]
["804563744"]
["804563746"]
["804563747"]
["804563748"]
["804563749"]
["804602702"]
["804602705"]
["804602716"]
["804602717"]
["804602720"]
["804623226"]
["804602722"]
["803646680"]
["803646681"]
["803646687"]
["803646689"]
["803452903"]
["803452921"]
["803451569"]
["803451588"]
["803522848"]
["803522850"]
["803504826"]
["803504829"]
["803504841"]
["803897205"]
["803897219"]
["803859213"]
["803859218"]
["803859219"]
["803859217"]
["803859220"]
["803859221"]
["804185588"]
["804185585"]
["804258371"]
["804185593"]
["804166116"]
["804166117"]
["804194478"]
["804194480"]
["804194481"]
["804194483"]
["804194486"]
["804194494"]
["804258130"]
["804258147"]
["804258148"]
["804258149"]
["804258150"]
["804258351"]
["804258373"]
["804240393"]
["804240394"]
["804240727"]
["803504849"]
["803565852"]
["803565856"]
["803565869"]
["803753256"]
["803753258"]
["803753259"]
["803524380"]
["803524381"]
["803524383"]
["803524389"]
["803865713"]
["803524398"]
["803524399"]
["803863177"]
["803863231"]
["803863237"]
["803865503"]
["803865706"]
["803865711"]
["803873646"]
["804917115"]
["804258047"]
["804240538"]
["804240539"]
["804258670"]
["804240541"]
["804258671"]
["804258672"]
["804240542"]
["804240543"]
["804240544"]
["804240545"]
["804240547"]
["804339188"]
["804339026"]
["804335939"]
["804335940"]
["803873707"]
["803873708"]
["804240280"]
["804240281"]
["804563903"]
["804563904"]
["804240775"]
["803873709"]
["804567501"]
["804563082"]
["804563083"]
["804596101"]
["804563087"]
["804602651"]
["804596155"]
["804596156"]
["804596157"]
["804596158"]
["804623885"]
["803646257"]
["803646390"]
["803477458"]
["803477460"]
["803477461"]
["803646267"]
["803646268"]
["803646380"]
["803646381"]
["803452884"]
["803452885"]
["803452887"]
["803452889"]
["803646393"]
["803452890"]
["803452892"]
["803452900"]
["803477466"]
["803477467"]
["803477471"]
["803477472"]
["803717860"]
["803477629"]
["803717864"]
["803717866"]
["803717867"]
["803717871"]
["803477951"]
["803717874"]
["803477952"]
["803477954"]
["803477953"]
["803477955"]
["803477956"]
["803477960"]
["803522976"]
["803522978"]
["803522979"]
["803452359"]
["803452362"]
["803452363"]
["803452374"]
["803452375"]
["803522988"]
["803522991"]
["803523000"]
["803524981"]
["803524984"]
["803524985"]
["803524993"]
["803504077"]
["803504079"]
["803504081"]
["803504082"]
["803504086"]
["803504087"]
["803504091"]
["803504093"]
["803504094"]
["803504096"]
["803504098"]
["803504092"]
["803873950"]
["803865836"]
["803888554"]
["803888560"]
["803888679"]
["803913420"]
["804166938"]
["804185466"]
["804185467"]
["804185468"]
["804185470"]
["804185481"]
["804185475"]
["804166487"]
["804166779"]
["804166781"]
["804166782"]
["804166788"]
["804166789"]
["804166790"]
["804166791"]
["804185311"]
["804166799"]
["804185321"]
["804185322"]
["804194312"]
["804258976"]
["804258993"]
["804258994"]
["804258996"]
["804258997"]
["804258001"]
["804258026"]
["804258027"]
["804258032"]
["804258033"]
["804258036"]
["804258038"]
["804258666"]
["804258044"]
["804240101"]
["803524432"]
["803524433"]
["803524434"]
["803524435"]
["803524436"]
["803524437"]
["803524438"]
["803524441"]
["803524442"]
["803524447"]
["803565777"]
["803565782"]
["803565785"]
["803565795"]
["803565797"]
["803565798"]
["803753054"]
["803753061"]
["803753062"]
["803753068"]
["803753069"]
["803753071"]
["803753072"]
["803577927"]
["803577935"]
["803577942"]
["803753912"]
["803753913"]
["803753914"]
["803753915"]
["803753916"]
["803753920"]
["803753922"]
["803753923"]
["803753954"]
["803753952"]
["803753955"]
["803753959"]
["803753960"]
["803753961"]
["803753962"]
["803852627"]
["803852628"]
["803852629"]
["803873444"]
["803852645"]
["803852649"]
["803852648"]
["803913151"]
["803913152"]
["803913153"]
["803913155"]
["803873926"]
["803873929"]
["803873933"]
["803888426"]
["803888428"]
["803873942"]
["803865827"]
["803904401"]
["803904402"]
["803904403"]
["803577518"]
["804249762"]
["804249768"]
["804249772"]
["804335813"]
["804249415"]
["804249419"]
["804249775"]
["804339233"]
["804339244"]
["804339246"]
["804339248"]
["804335579"]
["804335053"]
["804335594"]
["804335055"]
["804335058"]
["804335066"]
["804335072"]
["804335075"]
["804567476"]
["804602281"]
["804602283"]
["804602297"]
["804602298"]
["804602299"]
["804602300"]
["803646087"]
["803646090"]
["803646092"]
["803646099"]
["803452829"]
["803452831"]
["803452832"]
["803452840"]
["803477282"]
["803717857"]
["803477628"]
["803477638"]
["803477644"]
["803522061"]
["803522170"]
["803522069"]
["803522306"]
["803522312"]
["803524988"]
["803504605"]
["803504613"]
["803504614"]
["803504619"]
["803504624"]
["803524202"]
["803524204"]
["803524205"]
["803524206"]
["803524207"]
["803524208"]
["803904308"]
["803904309"]
["803904313"]
["803904314"]
["803904315"]
["803865840"]
["803904320"]
["803859902"]
["803859903"]
["803859909"]
["803904325"]
["803605485"]
["803605486"]
["803605487"]
["803859923"]
["803859924"]
["804166752"]
["804166753"]
["804166754"]
["804166755"]
["804166758"]
["804166760"]
["803605491"]
["804185483"]
["804185482"]
["804166766"]
["804166767"]
["804166768"]
["803605494"]
["804166775"]
["804194987"]
["804185500"]
["804194998"]
["804194999"]
["804166343"]
["804166349"]
["804249501"]
["804249507"]
["804249508"]
["804249509"]
["804249519"]
["804249243"]
["804249250"]
["804249759"]
["804249761"]
["804249401"]
["804249402"]
["803524214"]
["803524216"]
["803524218"]
["803504030"]
["803504033"]
["803504045"]
["803504046"]
["803753022"]
["803753002"]
["803754977"]
["803753011"]
["803753019"]
["803577939"]
["803753020"]
["803753851"]
["803753857"]
["803753858"]
["803753859"]
["803753860"]
["803753866"]
["803753867"]
["803753869"]
["803753870"]
["803753873"]
["803863102"]
["803863108"]
["803863124"]
["803863125"]
["803873440"]
["803873449"]
["803865431"]
["803865432"]
["803865433"]
["803865434"]
["803865437"]
["803865438"]
["803865441"]
["803865442"]
["803865449"]
["803865634"]
["803865635"]
["803865642"]
["803865643"]
["803913031"]
["803913837"]
["803913844"]
["803913846"]
["803913848"]
["803904306"]
["804240715"]
["804240718"]
["804240724"]
["804335576"]
["804335578"]
["804335592"]
["804335593"]
["804240282"]
["804335595"]
["804567235"]
["804567243"]
["804567244"]
["804596412"]
["804596425"]
["803646752"]
["803646755"]
["803646775"]
["803452186"]
["803451117"]
["803451123"]
["803522776"]
["803522777"]
["803522865"]
["803522784"]
["803522785"]
["803504152"]
["803504158"]
["803504159"]
["803504167"]
["803504168"]
["803504171"]
["803577519"]
["803888626"]
["803888643"]
["803888645"]
["803859505"]
["803859519"]
["803859520"]
["803859522"]
["804185352"]
["804185353"]
["804185357"]
["804185221"]
["804185323"]
["804258305"]
["804258306"]
["804258101"]
["804258102"]
["803859986"]
["803859989"]
["803859990"]
["804258112"]
["803753493"]
["803753500"]
["803753329"]
["803753332"]
["803754959"]
["803754961"]
["803754962"]
["803754965"]
["803754966"]
["803753335"]
["803753341"]
["803753346"]
["803753349"]
["803504140"]
["803504133"]
["803504138"]
["803880491"]
["803880492"]
["803873364"]
["803913086"]
["803913091"]
["803913092"]
["803913094"]
["803577507"]
["803577509"]
["803577514"]
["803577517"]
["804623805"]
["804623806"]
["804623807"]
["804556763"]
["804623808"]
["804556764"]
["804556765"]
["804917451"]
["804917453"]
["804917457"]
["804917459"]
["804917461"]
["804999483"]
["804917473"]
["804811627"]
["804811628"]
["804811629"]
["804602837"]
["804602838"]
["804986302"]
["804602839"]
["804986312"]
["804986314"]
["804986315"]
["804986319"]
["804986320"]
["804986321"]
["804986322"]
["804986325"]
["805003551"]
["805003552"]
["804999480"]
["804999481"]
["805413926"]
["804999486"]
["804999487"]
["804999489"]
["804999491"]
["805413937"]
["805413938"]
["805413939"]
["805413940"]
["805413927"]
["805413929"]
["805413930"]
["805413931"]
["805413934"]
["805413942"]
["805413945"]
["805413946"]
["805411929"]
["805411938"]
["805411939"]
["805411942"]
["805571843"]
["805571846"]
["805571847"]
["805571848"]
["805571849"]
["805266161"]
["805389029"]
["805266171"]
["805266172"]
["805525712"]
["805525718"]
["805525719"]
["805525722"]
["804602528"]
["804602534"]
["804602535"]
["804602539"]
["804596159"]
["804602852"]
["804602853"]
["804602854"]
["804602860"]
["803880223"]
["803505800"]
["803490058"]
["804623135"]
["804623145"]
["804623150"]
["804623525"]
["804811853"]
["804811866"]
["804811874"]
["804811875"]
["804812456"]
["804812458"]
["804812468"]
["804822831"]
["804822835"]
["804822848"]
["805004207"]
["805004214"]
["805004219"]
["805004220"]
["805004221"]
["805003601"]
["805003608"]
["805003618"]
["805412303"]
["805412312"]
["805412314"]
["805411802"]
["805411803"]
["805411821"]
["805389291"]
["805571860"]
["805571862"]
["805571863"]
["805572172"]
["805572174"]
["805572175"]
["805266177"]
["805266180"]
["805266184"]
["805266192"]
["805266194"]
["805266226"]
["805266230"]
["805389279"]
["805389278"]
["805266242"]
["805389280"]
["805389285"]
["805389286"]
["805265981"]
["805265995"]
["805689580"]
["805689585"]
["805689586"]
["805689591"]
["805689599"]
["804240085"]
["804335905"]
["804335906"]
["804335908"]
["804339461"]
["804335533"]
["804335540"]
["804335548"]
["804563228"]
["804563230"]
["804563236"]
["804563237"]
["804563238"]
["804339377"]
["804339378"]
["804563246"]
["804563250"]
["804567805"]
["804567809"]
["804567810"]
["804563714"]
["804339392"]
["804339398"]
["804339399"]
["804602354"]
["804602374"]
["804596901"]
["804596902"]
["804596925"]
["804623128"]
["804623130"]
["803451028"]
["803451030"]
["803477995"]
["803452284"]
["803452287"]
["803452288"]
["803452294"]
["803524727"]
["803524733"]
["803524739"]
["803524740"]
["803522280"]
["803522287"]
["803522297"]
["803904054"]
["803904055"]
["803904189"]
["803904059"]
["803873536"]
["803873539"]
["803873545"]
["803873547"]
["803873548"]
["803873549"]
["803873550"]
["803888682"]
["803888687"]
["803888695"]
["804166707"]
["804166722"]
["804166723"]
["804166724"]
["804194030"]
["804194045"]
["804194049"]
["804194356"]
["804194357"]
["804194360"]
["804194366"]
["804194367"]
["804185662"]
["804185665"]
["804185667"]
["804185669"]
["804194607"]
["804194609"]
["804194615"]
["804194620"]
["804258742"]
["804258744"]
["804258326"]
["804258350"]
["804249076"]
["804249082"]
["804249091"]
["804249094"]
["804240680"]
["804240681"]
["804240684"]
["804240689"]
["804240692"]
["804240693"]
["804240700"]
["803504207"]
["803504209"]
["803504210"]
["803565760"]
["803504009"]
["803504016"]
["803504019"]
["803504020"]
["803577009"]
["803577014"]
["803774520"]
["803880055"]
["803880072"]
["803863055"]
["803863073"]
["803873498"]
["803524597"]
["803824596"]
["803524598"]
["803913902"]
["803913903"]
["803913907"]
["803913908"]
["803913909"]
["803913917"]
["803913922"]
["803897356"]
["803897357"]
["803897364"]
["803897366"]
["803897367"]
["803897368"]
["804249221"]
["804249222"]
["804249223"]
["804335633"]
["804335634"]
["804335635"]
["803504802"]
["803504823"]
["803904361"]
["803904369"]
["803859673"]
["804185433"]
["804185441"]
["804185442"]
["804185796"]
["804185797"]
["804185799"]
["804185800"]
["804185036"]
["804185038"]
["804185047"]
["804185048"]
["804258763"]
["804258764"]
["804258765"]
["804240631"]
["804249208"]
["804249211"]
["803565802"]
["803577608"]
["803577612"]
["803774979"]
["803774987"]
["803863020"]
["803888741"]
["803888820"]
["803888823"]
["803873702"]
["803865952"]
["803865956"]
["803865972"]
["805437151"]
["804335765"]
["804623338"]
["804623339"]
["804916690"]
["804916698"]
["804916966"]
["804916968"]
["804811606"]
["804811617"]
["804811576"]
["805414147"]
["805414149"]
["805689761"]
["804240199"]
["804335755"]
["804335759"]
["804335772"]
["804249421"]
["804339629"]
["804339635"]
["804339636"]
["804339637"]
["804339642"]
["804339650"]
["804339652"]
["804339653"]
["804339655"]
["804339670"]
["804339674"]
["804563985"]
["804563986"]
["804563951"]
["804563952"]
["804563953"]
["804563960"]
["804563963"]
["804563966"]
["804563967"]
["804567326"]
["804567335"]
["804567336"]
["804567344"]
["804567345"]
["804567346"]
["804567347"]
["804602315"]
["804602316"]
["804602325"]
["804623326"]
["803522228"]
["803522240"]
["803522244"]
["803522250"]
["803524477"]
["803524480"]
["803524481"]
["803524483"]
["803904199"]
["803904190"]
["803904191"]
["803904192"]
["803904196"]
["803877076"]
["803904200"]
["803877081"]
["803877082"]
["803877083"]
["803877084"]
["803877095"]
["803877096"]
["803859303"]
["803859305"]
["803859307"]
["803859308"]
["803859310"]
["803859312"]
["803859313"]
["803859314"]
["803859315"]
["804166856"]
["804166860"]
["804166874"]
["804166875"]
["804185521"]
["804185524"]
["804185751"]
["804185756"]
["804185771"]
["804185774"]
["804185775"]
["804166230"]
["804166236"]
["804166238"]
["804166239"]
["804166248"]
["804240031"]
["804240043"]
["804240044"]
["804240045"]
["804240046"]
["804240047"]
["804240048"]
["804258804"]
["804258808"]
["804258809"]
["804258813"]
["804258463"]
["804258464"]
["804258466"]
["804258467"]
["804258468"]
["804258470"]
["804258471"]
["804258472"]
["804258473"]
["804240177"]
["804240178"]
["804240179"]
["804240180"]
["804240181"]
["804240182"]
["804240189"]
["804240192"]
["804240193"]
["804240194"]
["804240195"]
["803753406"]
["803524487"]
["803524490"]
["803524499"]
["803753410"]
["803753411"]
["803753415"]
["803753416"]
["803753419"]
["803753421"]
["803753422"]
["803753425"]
["803577443"]
["803863101"]
["803774894"]
["803774895"]
["803880105"]
["803880108"]
["803880118"]
["803880123"]
["803865601"]
["803865616"]
["803865618"]
["803897651"]
["803913264"]
["803913275"]
["803873678"]
["803873688"]
["803873682"]
["803873689"]
["803873690"]
["803873692"]
["803873695"]
["803873699"]
["803904176"]
["803904177"]
["803904179"]
["803904180"]
["803888877"]
["803888888"]
["803888894"]
["803888895"]
["805525827"]
["805525838"]
["805202727"]
["805526304"]
["805526321"]
["805526322"]
["805526325"]
["804249887"]
["804249890"]
["804249899"]
["804602992"]
["804339126"]
["804339134"]
["804339135"]
["804339136"]
["804339144"]
["804339145"]
["804339146"]
["804339147"]
["804240327"]
["804339088"]
["804240332"]
["804240337"]
["804240341"]
["804240350"]
["804335135"]
["804335139"]
["804335140"]
["804335149"]
["804567202"]
["804567203"]
["804567218"]
["804567219"]
["804567179"]
["804567180"]
["804567186"]
["804567191"]
["804567196"]
["804567198"]
["804596476"]
["804596477"]
["804596481"]
["804596482"]
["804596484"]
["804596485"]
["804596486"]
["804596489"]
["804602779"]
["804602793"]
["804602797"]
["804602798"]
["804602660"]
["804602662"]
["804602665"]
["804602666"]
["804602668"]
["804602675"]
["804602980"]
["804602981"]
["804602982"]
["804602983"]
["804602984"]
["804602989"]
["803913642"]
["803913644"]
["803913645"]
["803913646"]
["803913649"]
["803913390"]
["803913398"]
["803913404"]
["803913408"]
["803913411"]
["803913416"]
["803913418"]
["803913424"]
["804194063"]
["804194072"]
["804194082"]
["804194084"]
["804194087"]
["804194088"]
["804194091"]
["804194095"]
["804194098"]
["804194099"]
["804194100"]
["804166026"]
["804166027"]
["804166030"]
["804166035"]
["804166040"]
["804258492"]
["804258493"]
["804258494"]
["804258495"]
["804258496"]
["804258498"]
["804240506"]
["804240513"]
["804258072"]
["804240022"]
["804240023"]
["804240024"]
["804166951"]
["804166954"]
["804166957"]
["804166667"]
["804166961"]
["804166966"]
["804166970"]
["804166972"]
["804166974"]
["804166975"]
["804249877"]
["804249881"]
["803888789"]
["803888790"]
["803888792"]
["803888793"]
["803897959"]
["803897961"]
["803452139"]
["803913291"]
["803913305"]
["803913302"]
["803913307"]
["803913312"]
["803913316"]
["803913317"]
["803913626"]
["803913634"]
["803913635"]
["803913640"]
["804567943"]
["804917076"]
["804917082"]
["804917083"]
["804917084"]
["804917087"]
["804822727"]
["804822728"]
["804822736"]
["804822740"]
["804812426"]
["804812428"]
["804812434"]
["804812442"]
["804812447"]
["804812448"]
["804812449"]
["804812450"]
["805003901"]
["805003924"]
["805413626"]
["805413627"]
["805413632"]
["805413649"]
["805571929"]
["805571932"]
["805571945"]
["805413559"]
["805413567"]
["805413572"]
["805413539"]
["804240936"]
["804240937"]
["804240947"]
["804240949"]
["804240964"]
["804240974"]
["804339602"]
["804339615"]
["804339616"]
["804339621"]
["804563892"]
["804563896"]
["804567457"]
["804567459"]
["804567460"]
["804602576"]
["804602577"]
["804602578"]
["804258849"]
["804258838"]
["804258847"]
["804258850"]
["804567928"]
["803904080"]
["803904081"]
["803904091"]
["803904100"]
["804166927"]
["804166928"]
["804185398"]
["804185400"]
["804185191"]
["804185192"]
["804185196"]
["804185198"]
["804185199"]
["804194928"]
["804194932"]
["804194934"]
["804194936"]
["804194942"]
["804194329"]
["804194335"]
["804194344"]
["804194348"]
["804240927"]
["804240929"]
["804240930"]
["803863026"]
["803863027"]
["803897757"]
["803897758"]
["803897763"]
["803897764"]
["803897766"]
["803897769"]
["803897771"]
["803897772"]
["803897828"]
["803897841"]
["803897842"]
["803904001"]
["803904002"]
["803904005"]
["803904006"]
["803904008"]
["805257353"]
["805265629"]
["805265633"]
["805265502"]
["805265507"]
["805265515"]
["805525785"]
["805525786"]
["805525791"]
["805525796"]
["805525798"]
["805525800"]
["805690506"]
["805689909"]
["805689911"]
["803888541"]
["803897405"]
["803897410"]
["803897411"]
["803897423"]
["804916581"]
["804916582"]
["804822929"]
["804822945"]
["804822949"]
["804999098"]
["804999099"]
["805004067"]
["804916628"]
["804916636"]
["804916637"]
["804916646"]
["805413678"]
["805413679"]
["805413693"]
["805571551"]
["805572444"]
["805389008"]
["805389017"]
["805389018"]
["805526141"]
["804249980"]
["804249260"]
["804339954"]
["804339955"]
["804339956"]
["804339965"]
["804339968"]
["804249262"]
["804249264"]
["804249269"]
["804567154"]
["804567156"]
["804567157"]
["804567160"]
["804567161"]
["804567175"]
["804567356"]
["804567358"]
["804567363"]
["804602751"]
["804602767"]
["803913560"]
["803913572"]
["803859429"]
["803859236"]
["803859243"]
["804249287"]
["804185605"]
["804185606"]
["803859934"]
["803859936"]
["803859937"]
["803859942"]
["804166351"]
["804166354"]
["804166367"]
["804258857"]
["804249281"]
["804249282"]
["804249288"]
["804249300"]
["803888755"]
["803913051"]
["803897525"]
["803913074"]
["803913075"]
["803913655"]
["803913669"]
["803913552"]
["803913555"]
["803913556"]
["803913557"]
["804563998"]
["805436612"]
["805436622"]
["805265802"]
["805265804"]
["805265807"]
["805265824"]
["805265825"]
["805525538"]
["805525539"]
["805525540"]
["805525541"]
["805525543"]
["805525544"]
["805525546"]
["805203210"]
["805203214"]
["805203216"]
["805712056"]
["805712058"]
["805712062"]
["805453357"]
["804916744"]
["804823301"]
["804916699"]
["804823304"]
["804823309"]
["804823320"]
["804811539"]
["804998762"]
["804998733"]
["804998735"]
["804998736"]
["804998739"]
["805412007"]
["805412011"]
["805571605"]
["805571614"]
["805571617"]
["805412107"]
["805571620"]
["805412113"]
["805412115"]
["805265907"]
["805265914"]
["805265916"]
["805265920"]
["805266466"]
["805266470"]
["805526379"]
["805526383"]
["805203051"]
["805203357"]
["805690242"]
["805414346"]
["804249919"]
["804339204"]
["804339210"]
["804339211"]
["804339858"]
["804339220"]
["804339863"]
["804567620"]
["804567587"]
["804602084"]
["804602085"]
["804602094"]
["804602096"]
["804567305"]
["803859358"]
["803859359"]
["803859373"]
["803859374"]
["803859375"]
["804194531"]
["804185905"]
["804185907"]
["804185918"]
["804166158"]
["804166169"]
["804166170"]
["804166175"]
["804258401"]
["804258403"]
["804258414"]
["804258417"]
["804258425"]
["804249667"]
["805414313"]
["805711628"]
["805689814"]
["805389318"]
["805524088"]
["804623386"]
["804623387"]
["804623392"]
["804917476"]
["804917494"]
["804917495"]
["804917496"]
["804917497"]
["804917498"]
["804636244"]
["804811876"]
["804917460"]
["804811882"]
["804811883"]
["804811898"]
["804821163"]
["804821172"]
["804821008"]
["804821013"]
["804821014"]
["804821015"]
["804821019"]
["805414309"]
["805414312"]
["805414319"]
["805414320"]
["805572026"]
["805572038"]
["805572045"]
["805266251"]
["805266252"]
["805266264"]
["805266266"]
["805266267"]
["805389315"]
["805389316"]
["805389317"]
["805389323"]
["805389325"]
["805388781"]
["805689762"]
["805689991"]
["805689995"]
["805689996"]
["804249481"]
["804249485"]
["804335431"]
["804335449"]
["804339060"]
["804339072"]
["804339073"]
["804335015"]
["804335021"]
["804335024"]
["804567877"]
["804567879"]
["804567882"]
["804567887"]
["804569811"]
["804569812"]
["804569817"]
["804569818"]
["804569821"]
["803230293"]
["803230294"]
["803230295"]
["803230296"]
["803230298"]
["804596833"]
["804596835"]
["804596837"]
["804623376"]
["804185957"]
["804166551"]
["804429224"]
["804166554"]
["804166555"]
["804194447"]
["804258606"]
["804258608"]
["804258610"]
["804258613"]
["804258617"]
["804249860"]
["805430652"]
["805437051"]
["805711582"]
["805711583"]
["805202971"]
["805256971"]
["805593593"]
["805203133"]
["805203134"]
["805412027"]
["805430653"]
["805413922"]
["805689719"]
["805902481"]
["804623979"]
["804917192"]
["804917197"]
["804811902"]
["804811911"]
["804822591"]
["804822593"]
["804822594"]
["805004419"]
["805003535"]
["805412227"]
["805571763"]
["805571764"]
["805571768"]
["805436516"]
["805389252"]
["805389266"]
["804339754"]
["804339756"]
["804339757"]
["804339764"]
["804339773"]
["804240122"]
["804240125"]
["804339937"]
["804602905"]
["804602916"]
["804602921"]
["805437052"]
["805437053"]
["804623421"]
["804623423"]
["804623424"]
["804623616"]
["804623618"]
["804623619"]
["804623620"]
["804623621"]
["804916606"]
["804916608"]
["804916609"]
["804916610"]
["804916866"]
["804916868"]
["804917366"]
["804917367"]
["804917373"]
["804917375"]
["804811993"]
["804811994"]
["804811995"]
["804812351"]
["804812354"]
["804636739"]
["804636746"]
["805004101"]
["805004104"]
["805004105"]
["805004108"]
["805004182"]
["805004115"]
["805004117"]
["805004118"]
["805004331"]
["805004335"]
["805004336"]
["805004338"]
["805004339"]
["805412090"]
["805412092"]
["805412094"]
["805411955"]
["805411583"]
["805411587"]
["805572328"]
["805572330"]
["805572348"]
["805266127"]
["805266133"]
["805266139"]
["805266483"]
["805266488"]
["805266485"]
["805389354"]
["805389355"]
["805389353"]
["805389370"]
["805388663"]
["804339808"]
["804339809"]
["804339810"]
["804339815"]
["804339818"]
["804339819"]
["804563266"]
["804563271"]
["804567827"]
["804567833"]
["804567847"]
["804602206"]
["804602202"]
["804602203"]
["804602204"]
["804602205"]
["804602208"]
["804602217"]
["804602133"]
["804602138"]
["804602145"]
["804602954"]
["804602962"]
["804602966"]
["804602967"]
["804602969"]
["804623088"]
["804623089"]
["804623098"]
["805524215"]
["805203460"]
["805203465"]
["805203467"]
["805203471"]
["805203473"]
["805712507"]
["804623893"]
["804623896"]
["804623898"]
["804623729"]
["804623730"]
["804623731"]
["804623734"]
["804623736"]
["804623737"]
["804623740"]
["804623743"]
["804623744"]
["804623745"]
["804916908"]
["804916919"]
["804916920"]
["804916923"]
["804917430"]
["804917436"]
["804917437"]
["804917441"]
["804917442"]
["804917443"]
["804917444"]
["804822702"]
["804822703"]
["804822704"]
["804822708"]
["804822709"]
["804822712"]
["804822713"]
["804811506"]
["804811508"]
["804811509"]
["804811510"]
["804811511"]
["804811512"]
["804811515"]
["804811517"]
["804811518"]
["804811522"]
["804811525"]
["804998783"]
["804998784"]
["804998785"]
["804998786"]
["804998787"]
["804998791"]
["804998792"]
["805003802"]
["805003806"]
["805003807"]
["805003808"]
["805003824"]
["804999201"]
["804999202"]
["804999208"]
["804999211"]
["804999214"]
["804999217"]
["804999218"]
["804999219"]
["804999220"]
["804999224"]
["804999225"]
["804998705"]
["804998708"]
["805572024"]
["805572016"]
["805572022"]
["805572079"]
["805572082"]
["805572085"]
["805572088"]
["805572089"]
["805572090"]
["805572091"]
["805572097"]
["805572098"]
["805265530"]
["805525951"]
["805525954"]
["805525955"]
["805525957"]
["805525960"]
["805525961"]
["805525964"]
["805525974"]
["805525971"]
["805525973"]
["805525975"]
["805389426"]
["805389427"]
["805389428"]
["805389429"]
["805389434"]
["805389440"]
["805389446"]
["805525903"]
["805525904"]
["805525907"]
["804567128"]
["804567138"]
["804563906"]
["804563916"]
["804812005"]
["804822707"]
["804563920"]
["804563921"]
["804563922"]
["804563923"]
["804563532"]
["804563546"]
["804563547"]
["804596029"]
["804596030"]
["804596032"]
["804596037"]
["804596044"]
["804596047"]
["804596048"]
["804596049"]
["804602157"]
["804602164"]
["804602165"]
["804602173"]
["804602678"]
["804602175"]
["804602679"]
["804602683"]
["804602684"]
["804602686"]
["804563661"]
["804563662"]
["804563664"]
["804563670"]
["804563671"]
["804596753"]
["804596772"]
["804596773"]
["804596774"]
["804596775"]
["804623877"]
["804623785"]
["804563101"]
["804623791"]
["804623792"]
["804623793"]
["804623794"]
["804623795"]
["804623796"]
["804623799"]
["804623800"]
["804623878"]
["804623879"]
["804623884"]
["804623886"]
["804623887"]
["804623892"]
["805490862"]
["805490863"]
["805490864"]
["805490869"]
["805712287"]
["805712289"]
["805712299"]
["805902140"]
["805203010"]
["805203017"]
["805203018"]
["805202977"]
["805202978"]
["805202988"]
["805202998"]
["805203000"]
["805690027"]
["805690028"]
["805690029"]
["805690033"]
["805690034"]
["805690036"]
["805712126"]
["805712130"]
["805712132"]
["805203474"]
["805712145"]
["805712150"]
["805690041"]
["805339548"]
["805711928"]
["805711937"]
["804820903"]
["804820904"]
["805466853"]
["805692330"]
["804821030"]
["805466888"]
["805466891"]
["804623439"]
["804623440"]
["804623450"]
["804623239"]
["804623240"]
["804817146"]
["804817150"]
["804822678"]
["804822679"]
["804822698"]
["804822700"]
["804823433"]
["804823440"]
["804636530"]
["804823447"]
["804636532"]
["804636534"]
["804636537"]
["805003653"]
["805003654"]
["805003655"]
["805003656"]
["805003660"]
["805003662"]
["805003673"]
["805414229"]
["805003675"]
["805414228"]
["805414234"]
["804998627"]
["805414226"]
["805414227"]
["805414230"]
["805414231"]
["805414232"]
["805414238"]
["805414244"]
["805412246"]
["805414248"]
["805411989"]
["805436579"]
["805436581"]
["805572413"]
["805436587"]
["805436597"]
["805436598"]
["805266277"]
["805266278"]
["805526191"]
["805526184"]
["805526183"]
["805525606"]
["805525607"]
["805525615"]
["805525619"]
["805202701"]
["805525625"]
["805202703"]
["805202706"]
["805203082"]
["805202721"]
["805202723"]
["805202724"]
["805712157"]
["805712167"]
["805712173"]
["804623427"]
["805689941"]
["805689942"]
["805412026"]
["805412058"]
["805412059"]
["805412051"]
["805412065"]
["805412067"]
["805412072"]
["805412074"]
["805411876"]
["805411877"]
["805411879"]
["805411880"]
["805411881"]
["805411887"]
["805411889"]
["805411896"]
["805412288"]
["805412157"]
["805412160"]
["805412167"]
["805412168"]
["805265735"]
["805265748"]
["805265749"]
["805526053"]
["805526062"]
["805526063"]
["805526068"]
["805526071"]
["805526073"]
["805388876"]
["805526075"]
["805388878"]
["805388884"]
["805388885"]
["805388890"]
["805388892"]
["805388900"]
["805525637"]
["805525641"]
["805571721"]
["805388726"]
["805388728"]
["805388731"]
["805388734"]
["805411733"]
["805411727"]
["805411730"]
["805411732"]
["805411749"]
["805411755"]
["805430657"]
["805430666"]
["805430671"]
["805430670"]
["805571805"]
["805571820"]
["805571821"]
["805572457"]
["805572458"]
["805411655"]
["805411656"]
["805411663"]
["805436558"]
["805436560"]
["805525678"]
["805525687"]
["805526451"]
["805526452"]
["805526456"]
["805526458"]
["805526464"]
["805526466"]
["805411904"]
["805411905"]
["805411914"]
["805411918"]
["805411630"]
["805411637"]
["805411639"]
["805411640"]
["805411645"]
["805411649"]
["805572277"]
["805572280"]
["805572288"]
["805572300"]
["805265852"]
["805265854"]
["805265862"]
["805265863"]
["805265872"]
["805265873"]
["805265874"]
["805265875"]
["805389454"]
["805389452"]
["805389453"]
["805389455"]
["805389475"]
["805525814"]
["805525815"]
["805525820"]
["805525823"]
["805388557"]
["805388560"]
["805412428"]
["805412435"]
["805412436"]
["805412448"]
["805571657"]
["805571660"]
["805571661"]
["805571667"]
["805571673"]
["805571675"]
["805411776"]
["805411777"]
["805411778"]
["805411783"]
["805411784"]
["805571701"]
["805571710"]
["805571711"]
["805412476"]
["805411853"]
["805411857"]
["805411858"]
["805411608"]
["805412184"]
["805571713"]
["805525728"]
["805525737"]
["805525746"]
["805525749"]
["805526268"]
["805526365"]
["805526366"]
["805525656"]
["805388710"]
["805411831"]
["805411838"]
["805411850"]
["805572183"]
["805572193"]
["805572198"]
["805265930"]
["805265938"]
["805265941"]
["805265948"]
["805388912"]
["805388913"]
["805265676"]
["805525505"]
["805388701"]
["805388577"]
["805388704"]
["805388579"]
["805202904"]
["805202905"]
["805202909"]
["805690051"]
["805690053"]
["805203177"]
["805203178"]
["805712176"]
["805690066"]
["805572394"]
["805526101"]
["805572400"]
["805389128"]
["805389132"]
["805389136"]
["805266319"]
["805202854"]
["805265581"]
["805689613"]
["805689621"]
["805689625"]
["805526414"]
["805526417"]
["805526423"]
["805525762"]
["805203098"]
["805266051"]
["805266065"]
["805266068"]
["805266070"]
["805388857"]
["805388858"]
["805388862"]
["805388865"]
["805526327"]
["805526337"]
["805526344"]
["805202505"]
["805202506"]
["805202508"]
["805202509"]
["805202510"]
["805202511"]
["805202512"]
["805202514"]
["805202515"]
["805689886"]
["805689892"]
["805712332"]
["805712339"]
["805712345"]
["805712305"]
["805712306"]
["805712307"]
["805388976"]
["805388979"]
["805388985"]
["805389336"]
["805202827"]
["805525765"]
["805525769"]
["805388513"]
["805388514"]
["805202830"]
["805712400"]
["805389390"]
["805525910"]
["805525918"]
["805526432"]
["805526433"]
["805526435"]
["805202928"]
["805202943"]
["805712104"]
["805712120"]
["805388938"]
["805388941"]
["805388942"]
["805388943"]
["805388947"]
["805388611"]
["805388612"]
["805388613"]
["805388617"]
["805203483"]
["805203497"]
["805202956"]
["805202957"]
["805202973"]
["805202974"]
["805712478"]
["805902351"]
["805902352"]
["805689813"]
["805389349"]
["805712027"]
["805712028"]
["805712035"]
["805690507"]
["805389350"]
["805690039"]
["805690109"]
["805711827"]
["805902151"]
["805902152"]
["805690403"]
["805690476"]
["805690477"]
["805690480"]
["805388805"]
["805711707"]
["805690038"]
["805902353"]
["805690272"]
["805902205"]
["805902203"]
["805712253"]
["805712259"]
["805711687"]
["805712122"]
["805295334"]
["804812217"]
["803353861"]
["802637880"]
["803522216"]
["803904140"]
["803753675"]
["803774074"]
["803873780"]
["803913079"]
["802277784"]
["802664296"]
["803877075"]
["803353302"]
["804811719"]
["803258927"]
["804240278"]
["804567812"]
["804602994"]
["803904178"]
["804811516"]
["805414003"]
["804623413"]
["804817130"]
["804822738"]
["804917092"]
["804823305"]
["804812427"]
["804811700"]
["804999203"]
["804999213"]
["805004044"]
["804999493"]
["805412093"]
["805414062"]
["805414398"]
["805411839"]
["805412225"]
["805571625"]
["805571942"]
["805572287"]
["805571850"]
["805265536"]
["805436594"]
["805412348"]
["805525966"]
["805525510"]
["805388607"]
["805526462"]
["805388610"]
["805203323"]
["805689643"]
["805689987"]
["801765868"]
["801774406"]
["801774407"]
["801774976"]
["801765717"]
["801774095"]
["801774275"]
["801353565"]
["801765732"]
["801568665"]
["801656707"]
["801656524"]
["801765762"]
["801765695"]
["803102352"]
["803031672"]
["803309340"]
["803353441"]
["803090276"]
["803353116"]
["803353807"]
["803090347"]
["803250230"]
["803250334"]
["803353651"]
["803353886"]
["803090723"]
["803090724"]
["803250381"]
["803250587"]
["803353679"]
["803090671"]
["803147894"]
["803250172"]
["803258476"]
["803250791"]
["803258093"]
["803250760"]
["803102961"]
["803250721"]
["803250822"]
["803258703"]
["803258705"]
["803258706"]
["803147101"]
["803147158"]
["803147159"]
["803147657"]
["803147399"]
["803031275"]
["803102507"]
["803074958"]
["803102853"]
["803102631"]
["803309801"]
["803309387"]
["802277442"]
["802636289"]
["802664130"]
["802664476"]
["802664328"]
["802664880"]
["802664881"]
["802930601"]
["802664439"]
["802930428"]
["802256926"]
["802336340"]
["802208084"]
["802209179"]
["802277951"]
["802277952"]
["802336646"]
["802220553"]
["804339064"]
["804335732"]
["804339260"]
["804563841"]
["804567683"]
["804567628"]
["804596401"]
["804563084"]
["803230297"]
["804602801"]
["804623152"]
["803258778"]
["803031374"]
["803258414"]
["803646042"]
["803646043"]
["803477515"]
["803477314"]
["803452411"]
["803522759"]
["803504996"]
["803524684"]
["803522674"]
["803504106"]
["803504117"]
["803504118"]
["803865838"]
["803865973"]
["803865974"]
["803904028"]
["803904031"]
["803888915"]
["803888924"]
["804185262"]
["803859304"]
["803859933"]
["804194435"]
["804194436"]
["804166815"]
["804258940"]
["804258761"]
["804249627"]
["804166669"]
["803490075"]
["803577989"]
["803310323"]
["803888320"]
["803865694"]
["803865929"]
["803913847"]
["803888937"]
["803897157"]

{"sheet":"# constat-dos-appel","index":3,"n_rows":1210,"n_cols":6,"rows_kept":1210,"cut":false,"hidden":false,"merged":[]}
["Numéro de constat","code du constat","numéro de dossier opérationnel","code du dossier","Numéro de carte d'appel","code de la carte d'appel "]
["802636136","RM450","144080321002","8100"]
["802664275","RM450","144080713006","8100"]
["802664978","RM450","144080817002","8100","800808170011","R397"]
["802664992","RM450","144081004006","8100","800810040052","2130"]
["802636375","RM450","144081017016","8100","800810170078","3430"]
["802664899","RM450","144081108004","8100","800811080025","1400"]
["802930293","RM450","144081114003","8100","800811140009","R201"]
["803074639","RM450","144090824002","8100"]
["803353320","RM450","144100531009","8100"]
["803250023","RM450","144100827010","8100"]
["803873816","RM450","144120630014","8100"]
["803913855","RM450","144120926002","8100"]
["803913022","RM450","144121001014","8100"]
["803897437","RM450","144121008014","8100"]
["803913291","RM450","144121008015","8100"]
["803897439","RM450","144121009013","8100","801210090068","8003"]
["803897815","RM450","144121013002","8100","801210130005","8003"]
["803913669","RM450","144121013003","8100","801210130014","R397"]
["803913094","RM450","144121013013","8100"]
["803914000","RM450","144121016011","8100"]
["803865892","RM450","144121017019","8100"]
["803865952","RM450","144121019001","8100"]
["803888426","RM450","144121027006","8100"]
["803888526","RM450","144121027007","8100","801210270026","R102"]
["803873942","RM450","144121101005","8100","801211010012","R397"]
["803865469","RM450","144121101007","8100","801211010019","R201"]
["803865264","RM450","144121105001","8100"]
["803913195","RM450","144121116002","8100"]
["803888332","RM450","144121117010","8100"]
["803913199","RM450","144121118003","8100"]
["803577514","RM450","144121210006","8100"]
["803877146","RM450","144121213007","8100","801212130036","8003"]
["803888941","RM450","144121213009","8100","801212130041","3430"]
["803913556","RM450","144121218012","8100"]
["803873578","RM450","144121222004","8100"]
["803904376","RM450","144121222005","8100"]
["803873579","RM450","144121222009","8100","801212220028","3430"]
["803888367","RM450","144121222026","8100","801212220127","8003"]
["803904306","RM450","144121223004","8100","801212230014","8003"]
["803913521","RM450","144121223006","8100","801212230018","8003"]
["803904401","RM450","144121223012","8100","801212230078","C511"]
["803913640","RM450","144121227008","8100","801212270035","8003"]
["803904402","RM450","144121227012","8100"]
["803873950","RM450","144130105003","8100","801301050010","3430"]
["803888651","RM450","144130112001","8100"]
["803524245","RM450","144130115012","8100","801301150030","8003"]
["803913355","RM450","144130123012","8100"]
["803913491","RM450","144130126002","8100","801301260001","E311"]
["803888656","RM450","144130126007","8100","801301260045","R397"]
["803904361","RM450","144130203003","8100","801302030013","C511"]
["803897165","RM450","144130207024","8100","801302070085","1431"]
["803913442","RM450","144130210003","8100","801302100005","E311"]
["803888643","RM450","144130211001","8100"]
["803873612","RM450","144130213001","8100"]
["803859778","RM450","144130213013","8100","801302130055","8003"]
["803913365","RM450","144130213014","8100"]
["803859429","RM450","144130215003","8100","801302150014","R303"]
["803873599","RM450","144130216002","8100","801302160005","E311"]
["803873545","RM450","144130220023","8100","801302200075","8003"]
["803877068","RM450","144130223003","8100","801302230013","R116"]
["803859843","RM450","144130302003","8100","801303020001","8003"]
["803859176","RM450","144130302007","8100"]
["803913408","RM450","144130302011","8100"]
["803913411","RM450","144130303007","8100","801303030025","8003"]
["803859785","RM450","144130319014","8100"]
["804194276","RM450","144130319014","8100"]
["803859505","RM450","144130322002","8100","801303220005","8003"]
["803859303","RM450","144130322003","8100"]
["803873572","RM450","144130324001","8100"]
["804194153","RM450","144130324003","8100"]
["803877035","RM450","144130325004","8100","801303250017","8003"]
["803859849","RM450","144130325008","8100","801303240057","R102"]
["803865815","RM450","144130326014","8100","801303260046","8003"]
["803859769","RM450","144130326015","8100","801303260049","R102"]
["803859469","RM450","144130327002","8100","801303270004","3430"]
["803859187","RM450","144130327014","8100","801303270076","8003"]
["803873573","RM450","144130328001","8100"]
["803605271","RM450","144130328018","8100","801303280047","3430"]
["804185701","RM450","144130328019","8100","801303280050","3430"]
["803605309","RM450","144130328021","8100","801303280063","3430"]
["803863171","RM450","144130329001","8100"]
["804166928","RM450","144130329005","8100","801303290019","R400"]
["804166980","RM450","144130329014","8100"]
["804185703","RM450","144130329015","8100","801303290065","3430"]
["803859312","RM450","144130404002","8100","801304040005","C511"]
["803859789","RM450","144130404002","8100","801304040005","C511"]
["803859314","RM450","144130405001","8100","801304050003","8003"]
["803859773","RM450","144130405003","8100"]
["804194551","RM450","144130407002","8100","801304070022","3430"]
["804166938","RM450","144130410013","8100"]
["804185844","RM450","144130411002","8100"]
["804194552","RM450","144130411004","8100"]
["803904071","RM450","144130412015","8100","801304120057","8003"]
["803859520","RM450","144130413006","8100","801304130026","E311"]
["803859673","RM450","144130413016","8100","801304130071","R116"]
["803859375","RM450","144130414004","8100"]
["803859374","RM450","144130414004","8100"]
["803859522","RM450","144130414007","8100","801304140025","1431"]
["804166801","RM450","144130415004","8100","801304150009","8003"]
["804185480","RM450","144130417027","8100","801304170044","1431"]
["804185712","RM450","144130420003","8100","801304200009","R102"]
["804185277","RM450","144130423001","8100","801304220074","3430"]
["804194045","RM450","144130423005","8100","801304230010","3430"]
["804185483","RM450","144130425015","8100"]
["804185278","RM450","144130426001","8100","801304260009","8003"]
["804166860","RM450","144130426003","8100"]
["804185482","RM450","144130426007","8100","801304260056","3430"]
["804185481","RM450","144130426008","8100"]
["803859792","RM450","144130427003","8100","801304270033","8003"]
["804194165","RM450","144130427003","8100","801304270033","8003"]
["804194218","RM450","144130427004","8100","801304270045","8003"]
["804194140","RM450","144130430001","8100"]
["804166485","RM450","144130430004","8100"]
["804194287","RM450","144130430008","8100"]
["804194557","RM450","144130501014","8100","801305010039","8003"]
["803859395","RM450","144130502019","8100","801305020086","1431"]
["804185226","RM450","144130503004","8100"]
["804194404","RM450","144130515001","8100"]
["804194381","RM450","144130516012","8100","801305160054","8003"]
["803859797","RM450","144130517011","8100","801305170067","8003"]
["803859796","RM450","144130517011","8100","801305170067","8003"]
["804166875","RM450","144130517015","8100"]
["804166874","RM450","144130517016","8100","801305170103","8003"]
["804194360","RM450","144130518010","8100"]
["803859798","RM450","144130518011","8100"]
["803877052","RM450","144130519009","8100"]
["803877051","RM450","144130519009","8100"]
["804185006","RM450","144130525003","8100","801305250027","E311"]
["804194521","RM450","144130526002","8100"]
["804185984","RM450","144130529013","8100","801305290079","1431"]
["804194300","RM450","144130529016","8100"]
["804185796","RM450","144130601003","8100"]
["804185327","RM450","144130603002","8100"]
["804194565","RM450","144130603014","8100","801306030069","8003"]
["804166502","RM450","144130611004","8100"]
["804185135","RM450","144130614003","8100"]
["804194573","RM450","144130614004","8100","801306140006","8003"]
["804166731","RM450","144130615004","8100"]
["804194422","RM450","144130615006","8100"]
["804166732","RM450","144130615007","8100"]
["804185799","RM450","144130615014","8100"]
["804194685","RM450","144130615015","8100","801306150073","8003"]
["804185185","RM450","144130616013","8100"]
["804185058","RM450","144130619011","8100"]
["804185056","RM450","144130619011","8100"]
["804185057","RM450","144130619011","8100"]
["804185055","RM450","144130619011","8100"]
["803873849","RM450","144130619016","8100","801306190079","3430"]
["804185172","RM450","144130619016","8100","801306190079","3430"]
["804185524","RM450","144130626006","8100","801306260051","E311"]
["804185139","RM450","144130628022","8100","801306280080","8003"]
["804185196","RM450","144130629010","8100","801306290081","R102"]
["804166117","RM450","144130629011","8100"]
["804185036","RM450","144130630009","8100"]
["804185199","RM450","144130701019","8100","801307010069","C512"]
["803859937","RM450","144130704014","8100"]
["804185291","RM450","144130707003","8100","801307070011","8003"]
["804194843","RM450","144130709008","8100","801307090068","R400"]
["804166276","RM450","144130709010","8100","801307090075","8003"]
["804185275","RM450","144130709011","8100","801307090088","R397"]
["804194998","RM450","144130712004","8100","801307120027","8003"]
["804185322","RM450","144130712010","8100"]
["804166075","RM450","144130712011","8100"]
["803859942","RM450","144130713007","8100","801307130057","8003"]
["804194620","RM450","144130718012","8100"]
["804166230","RM450","144130718014","8100","801307180091","8003"]
["804194752","RM450","144130718015","8100","801307180093","R102"]
["804166739","RM450","144130720003","8100"]
["804194864","RM450","144130720004","8100","801307200063","2120"]
["804194864","RM450","144130720004","8100","801307200010","1400"]
["804194934","RM450","144130726016","8100","801307260093","8003"]
["804166170","RM450","144130727013","8100"]
["804166260","RM450","144130731009","8100"]
["804194438","RM450","144130801007","8100","801308010043","8003"]
["804194878","RM450","144130803003","8100","801308030032","3430"]
["804166551","RM450","144130804012","8100"]
["804166749","RM450","144130812011","8100"]
["804166555","RM450","144130814019","8100","801308140058","A200"]
["804258953","RM450","144130817003","8100","801308170018","8003"]
["804240506","RM450","144130819008","8100","801308190040","3430"]
["804194445","RM450","144130823004","8100","801308230014","1431"]
["804258306","RM450","144130824002","8100"]
["804194447","RM450","144130825002","8100","801308250017","8003"]
["804240511","RM450","144130825006","8100","801308250035","R116"]
["804249507","RM450","144130903001","8100"]
["804249509","RM450","144130905001","8100","801309050004","R397"]
["804258782","RM450","144130905003","8100"]
["804166135","RM450","144130905015","8100","801309050043","R115"]
["804258955","RM450","144130905018","8100"]
["804194450","RM450","144130911002","8100"]
["804258026","RM450","144130912012","8100","801309120054","E311"]
["804258214","RM450","144130915006","8100","801309150014","8003"]
["804185566","RM450","144130916002","8100"]
["804258167","RM450","144130916006","8100"]
["804258959","RM450","144130916015","8100"]
["804258422","RM450","144130917041","8100","801309170099","8003"]
["804194335","RM450","144130919010","8100","801309190057","3430"]
["804166650","RM450","144130920001","8100"]
["804249604","RM450","144130920005","8100","801309200013","8003"]
["804166417","RM450","144130920014","8100"]
["804258964","RM450","144130921004","8100"]
["804166392","RM450","144130921006","8100"]
["804166391","RM450","144130921006","8100"]
["804258072","RM450","144130921010","8100"]
["804185099","RM450","144130925013","8100"]
["804249030","RM450","144130926014","8100","801309260066","9330"]
["804249030","RM450","144130926014","8100","801309260068","R102"]
["804185100","RM450","144130926019","8100"]
["804166398","RM450","144130927015","8100","801309270093","8003"]
["804258765","RM450","144130928003","8100","801309280015","E311"]
["804249032","RM450","144130928011","8100"]
["804258909","RM450","144130929002","8100"]
["804258311","RM450","144130930002","8100"]
["804258576","RM450","144131001008","8100","801310010043","8003"]
["804258234","RM450","144131002002","8100","801310020012","8003"]
["804258312","RM450","144131003002","8100","801310030008","C511"]
["804258577","RM450","144131004002","8100","801310040039","R109"]
["804258577","RM450","144131004002","8100","801310040010","3430"]
["804258577","RM450","144131004002","8100","801310040011","R400"]
["804249155","RM450","144131008019","8100","801310080061","8003"]
["804258219","RM450","144131008022","8100","801310070071","C511"]
["804258913","RM450","144131009019","8100","801310090085","R102"]
["804258223","RM450","144131009020","8100"]
["804249606","RM450","144131010004","8100"]
["804194344","RM450","144131011017","8100","801310110092","8003"]
["804166531","RM450","144131012002","8100"]
["804240427","RM450","144131012006","8100","801310120048","1640"]
["804258857","RM450","144131013014","8100","801310130059","8003"]
["804258284","RM450","144131018013","8100"]
["804166400","RM450","144131019002","8100"]
["804249191","RM450","144131022004","8100","801310220009","8003"]
["804258610","RM450","144131023001","8100","801310230007","8003"]
["804258373","RM450","144131031001","8100","801310310003","3430"]
["804258464","RM450","144131101010","8100","801310310063","2130"]
["804258464","RM450","144131101010","8100","801311010065","8003"]
["804240684","RM450","144131109011","8100","801311090071","3430"]
["804258038","RM450","144131110001","8100"]
["804249667","RM450","144131110006","8100","801311100040","1431"]
["804240927","RM450","144131112009","8100","801311120037","3430"]
["804240576","RM450","144131114003","8100","801311140021","C511"]
["804240177","RM450","144131115011","8100","801311150058","8003"]
["804240526","RM450","144131116001","8100","801311160011","R102"]
["804258247","RM450","144131116012","8100","801311160067","3430"]
["804249804","RM450","144131122002","8100"]
["804249805","RM450","144131123002","8100","801311230007","8003"]
["804240276","RM450","144131128001","8100"]
["804240212","RM450","144131128002","8100"]
["804166520","RM450","144131129001","8100","801311290012","8003"]
["804249622","RM450","144131201002","8100"]
["804249571","RM450","144131201008","8100","801312010060","8003"]
["804240692","RM450","144131202001","8100","801312020005","8003"]
["804240854","RM450","144131202001","8100","801312020005","8003"]
["804249832","RM450","144131207003","8100","801312070007","8003"]
["804240848","RM450","144131207004","8100"]
["804240849","RM450","144131207004","8100"]
["804166640","RM450","144131208008","8100"]
["804166970","RM450","144131208012","8100","801312080064","8003"]
["804249678","RM450","144131210001","8100","801312100007","R397"]
["804240228","RM450","144131210007","8100","801312100031","E311"]
["804258666","RM450","144131210012","8100"]
["804249680","RM450","144131212002","8100"]
["804249681","RM450","144131212005","8100","801312120009","R397"]
["804240229","RM450","144131213005","8100"]
["804240217","RM450","144131216013","8100"]
["804249426","RM450","144131218003","8100","801312180003","1431"]
["804240466","RM450","144131219026","8100"]
["804240916","RM450","144140101005","8100","801401010037","R115"]
["804249980","RM450","144140103007","8100","801401030047","8003"]
["804258047","RM450","144140105003","8100","801401050040","R102"]
["804241000","RM450","144140106017","8100","801401060088","E311"]
["804240539","RM450","144140106018","8100"]
["804240588","RM450","144140109001","8100","801401090003","1625"]
["804240756","RM450","144140109002","8100","801401090004","R397"]
["804335203","RM450","144140120001","8100","801401200008","R116"]
["804249466","RM450","144140121010","8100","801401210051","E311"]
["804335778","RM450","144140126002","8100","801401260008","3430"]
["804335856","RM450","144140128003","8100"]
["804249919","RM450","144140129002","8100","801401290009","3430"]
["804249890","RM450","144140129012","8100","801401290072","8003"]
["804335755","RM450","144140130012","8100","801401300056","R400"]
["804240543","RM450","144140131004","8100","801401310010","8003"]
["804249847","RM450","144140131011","8100"]
["804335906","RM450","144140131020","8100","801401310057","R400"]
["804249472","RM450","144140201001","8100"]
["804240544","RM450","144140201002","8100"]
["804249811","RM450","144140201005","8100"]
["804335633","RM450","144140201006","8100"]
["804335377","RM450","144140201011","8100","801402010039","8003"]
["804240595","RM450","144140201012","8100","801402010046","8003"]
["804240314","RM450","144140201013","8100"]
["804194811","RM450","144140204001","8100","801402040007","8003"]
["804240599","RM450","144140208001","8100","801402080006","8003"]
["804335251","RM450","144140209001","8100","801402090008","R102"]
["804249124","RM450","144140210001","8100","801402100001","8003"]
["804240748","RM450","144140210006","8100","801402100021","8003"]
["804240949","RM450","144140212001","8100"]
["804335236","RM450","144140212012","8100","801402120048","8003"]
["804240770","RM450","144140213002","8100","801402130006","8003"]
["804249815","RM450","144140215008","8100"]
["804335402","RM450","144140220008","8100","801402200018","8003"]
["804249819","RM450","144140220013","8100"]
["804335985","RM450","144140220014","8100","801402200027","8003"]
["804335253","RM450","144140220016","8100"]
["804249260","RM450","144140221005","8100"]
["804335256","RM450","144140221016","8100","801402210058","R102"]
["804249367","RM450","144140221017","8100","801402210068","3430"]
["804335404","RM450","144140224015","8100","801402240078","3430"]
["804339581","RM450","144140224016","8100","801402240077","3430"]
["804339851","RM450","144140227021","8100","801402270059","3430"]
["804240127","RM450","144140228013","8100","801402280085","8003"]
["804339954","RM450","144140228015","8100","801402280090","A100"]
["804339853","RM450","144140228016","8100","801402280092","1431"]
["804240129","RM450","144140301003","8100","801403010060","8003"]
["804339181","RM450","144140313003","8100"]
["804339210","RM450","144140316006","8100"]
["804339968","RM450","144140316007","8100","801403160043","A100"]
["804339188","RM450","144140318007","8100"]
["804339189","RM450","144140318008","8100"]
["804339833","RM450","144140321004","8100","801403210009","8003"]
["804240964","RM450","144140321017","8100"]
["804240142","RM450","144140322001","8100","801403210103","R102"]
["804335449","RM450","144140322013","8100"]
["804339233","RM450","144140322014","8100","801403220038","3430"]
["804335278","RM450","144140322015","8100"]
["804339026","RM450","144140322017","8100"]
["804335223","RM450","144140322018","8100","801403220051","8003"]
["804335997","RM450","144140322021","8100","801403220063","8003"]
["804339729","RM450","144140323006","8100","801403230049","8003"]
["804249701","RM450","144140324003","8100"]
["804339101","RM450","144140324011","8100","801403240066","8003"]
["804240265","RM450","144140329002","8100","801403290006","3430"]
["804339599","RM450","144140331013","8100","801403310044","3430"]
["804339858","RM450","144140331015","8100"]
["804339403","RM450","144140401012","8100","801404010041","8003"]
["804258522","RM450","144140401013","8100","801404010042","8003"]
["804258004","RM450","144140401016","8100"]
["804339710","RM450","144140402002","8100","801404020012","8003"]
["804335726","RM450","144140402016","8100"]
["804339060","RM450","144140402017","8100"]
["804258005","RM450","144140402022","8100"]
["804339711","RM450","144140403004","8100","801404030028","R102"]
["804335682","RM450","144140404006","8100"]
["804339810","RM450","144140406005","8100","801404060026","3430"]
["804240279","RM450","144140406007","8100"]
["804339483","RM450","144140406008","8100","801404060032","3430"]
["804339655","RM450","144140406010","8100"]
["804339327","RM450","144140406012","8100","801404060056","8003"]
["804335728","RM450","144140407011","8100","801404070058","8003"]
["804335729","RM450","144140407011","8100","801404070058","8003"]
["804240646","RM450","144140408001","8100","801404080001","R102"]
["804339508","RM450","144140409008","8100"]
["804339509","RM450","144140409009","8100"]
["804339284","RM450","144140409012","8100"]
["804240327","RM450","144140411003","8100","801404110006","8003"]
["804339246","RM450","144140412010","8100","801404120057","8003"]
["804335690","RM450","144140413006","8100"]
["804240332","RM450","144140413011","8100","801404130038","R102"]
["804240625","RM450","144140420002","8100","801404200004","8003"]
["804335325","RM450","144140420003","8100"]
["804335478","RM450","144140421009","8100"]
["804339517","RM450","144140424009","8100"]
["803873708","RM450","144140425001","8100","801404250001","E311"]
["804339602","RM450","144140425017","8100","801404250068","8003"]
["804339602","RM450","144140425017","8100","801404250069","1431"]
["804240280","RM450","144140426003","8100"]
["804240350","RM450","144140426004","8100","801404260009","R400"]
["804240274","RM450","144140501012","8100"]
["804335693","RM450","144140501013","8100","801405010077","3430"]
["804335734","RM450","144140502009","8100"]
["804335735","RM450","144140502009","8100"]
["804339018","RM450","144140504004","8100","801405040025","8003"]
["804339291","RM450","144140504008","8100","801405040051","3430"]
["804335607","RM450","144140509004","8100","801405090016","8003"]
["804339298","RM450","144140509007","8100","801405090043","3430"]
["804563176","RM450","144140512004","8100","801405120006","R115"]
["804335741","RM450","144140512016","8100","801405120045","2130"]
["804335741","RM450","144140512016","8100","801405120060","8003"]
["804339674","RM450","144140512017","8100"]
["804339300","RM450","144140513016","8100","801405130063","R400"]
["804563433","RM450","144140514007","8100"]
["804563327","RM450","144140517007","8100","801405170029","3430"]
["804563985","RM450","144140520007","8100","801405200081","8003"]
["804240775","RM450","144140522001","8100","801405220006","R102"]
["804563932","RM450","144140531005","8100"]
["804335195","RM450","144140601006","8100","801406010019","3430"]
["804563410","RM450","144140606007","8100","801406060033","E311"]
["804563951","RM450","144140606008","8100","801406060037","8003"]
["804563953","RM450","144140606010","8100","801406060041","3430"]
["804567003","RM450","144140606019","8100","801406060099","R201"]
["804563160","RM450","144140612011","8100"]
["804563391","RM450","144140613011","8100","801406130083","8003"]
["804335524","RM450","144140616009","8100","801406160074","1431"]
["804567879","RM450","144140618009","8100"]
["804335066","RM450","144140619007","8100","801406190032","3430"]
["804563394","RM450","144140619008","8100"]
["804567982","RM450","144140622003","8100","801406220037","3430"]
["804563168","RM450","144140622010","8100"]
["804563169","RM450","144140623008","8100"]
["804567156","RM450","144140629004","8100"]
["804567951","RM450","144140630011","8100","801406300080","E311"]
["804563830","RM450","144140701005","8100"]
["804240122","RM450","144140704002","8100","801407040012","3430"]
["804339863","RM450","144140708013","8100","801407080065","8003"]
["804339033","RM450","144140708014","8100"]
["804563896","RM450","144140711012","8100","801407110090","1431"]
["804563896","RM450","144140711012","8100","801407110095","3430"]
["804567882","RM450","144140712004","8100"]
["804567611","RM450","144140712010","8100"]
["804567812","RM450","144140712011","8100"]
["804567618","RM450","144140718003","8100"]
["804335420","RM450","144140720004","8100"]
["804335042","RM450","144140723001","8100","801407230005","R102"]
["804563532","RM450","144140724012","8100","801407240064","3430"]
["804563849","RM450","144140725006","8100"]
["804567622","RM450","144140726010","8100"]
["804567039","RM450","144140726014","8100"]
["804563082","RM450","144140726021","8100","801407260078","R115"]
["804567529","RM450","144140727001","8100"]
["804567847","RM450","144140727002","8100","801407270005","3430"]
["803873711","RM450","144140802001","8100","801408010095","8003"]
["803873712","RM450","144140802003","8100"]
["804567356","RM450","144140806014","8100"]
["804563778","RM450","144140808005","8100"]
["804339937","RM450","144140808015","8100"]
["804596692","RM450","144140809010","8100","801408090058","8003"]
["804567623","RM450","144140815012","8100"]
["804567624","RM450","144140815016","8100"]
["804596482","RM450","144140816005","8100","801408160007","R115"]
["804567406","RM450","144140816010","8100"]
["804258014","RM450","144140820010","8100","801408200072","3430"]
["804596326","RM450","144140821009","8100","801408210026","8003"]
["804596704","RM450","144140821023","8100","801408210084","R102"]
["804567378","RM450","144140825009","8100"]
["803873718","RM450","144140825012","8100","801408250093","E311"]
["804563753","RM450","144140827002","8100","801408270011","8003"]
["804596207","RM450","144140829010","8100"]
["804567546","RM450","144140830001","8100","801408290106","E311"]
["804567547","RM450","144140830004","8100","801408300014","8003"]
["804567548","RM450","144140831003","8100"]
["804602204","RM450","144140831004","8100"]
["804567347","RM450","144140831006","8100","801408310014","8003"]
["804602205","RM450","144140831009","8100","801408310016","8003"]
["804602501","RM450","144140904001","8100"]
["804596082","RM450","144140905011","8100"]
["804567415","RM450","144140906001","8100","801409060010","R397"]
["804563747","RM450","144140906007","8100"]
["804602751","RM450","144140906008","8100","801409060025","3430"]
["804602208","RM450","144140907009","8100"]
["804567392","RM450","144140908008","8100"]
["804567700","RM450","144140912001","8100"]
["804596438","RM450","144140912002","8100","801409120005","1431"]
["804602316","RM450","144140913008","8100","801409130016","3430"]
["804567421","RM450","144140918010","8100","801409180059","8003"]
["804602534","RM450","144140919002","8100","801409190008","R102"]
["804602261","RM450","144140923014","8100","801409230058","3430"]
["804602702","RM450","144140924010","8100"]
["804602273","RM450","144141003003","8100"]
["804335492","RM450","144141003008","8100"]
["803230295","RM450","144141005008","8100","801410050036","3430"]
["804596398","RM450","144141011001","8100","801410100081","2160"]
["804563612","RM450","144141012011","8100"]
["804602662","RM450","144141013007","8100"]
["804602665","RM450","144141015003","8100","801410150040","3430"]
["804596125","RM450","144141018007","8100","801410180038","R102"]
["804602927","RM450","144141018010","8100","801410180053","3430"]
["804602299","RM450","144141018013","8100","801410180071","3430"]
["804602559","RM450","144141025008","8100","08-141025-01","3430"]
["804596144","RM450","144141025009","8100","08-141025-01","8003"]
["804596534","RM450","144141025010","8100"]
["804596851","RM450","144141029007","8100","08-141029-00","8003"]
["804602563","RM450","144141030004","8100","08-141030-00","8003"]
["804596550","RM450","144141030005","8100"]
["804596854","RM450","144141030006","8100"]
["804596855","RM450","144141030009","8100"]
["804602381","RM450","144141031011","8100","08-141031-01","3430"]
["804602609","RM450","144141103011","8100"]
["804602717","RM450","144141104009","8100","08-141104-00","R201"]
["804602853","RM450","144141109010","8100"]
["804596883","RM450","144141111015","8100","08-141111-01","8003"]
["804602981","RM450","144141113008","8100"]
["804596150","RM450","144141114004","8100"]
["804602983","RM450","144141114005","8100","08-141114-00","8003"]
["804602802","RM450","144141115004","8100"]
["804596812","RM450","144141116002","8100"]
["804596888","RM450","144141116009","8100"]
["804596962","RM450","144141121002","8100","08-141121-00","8003"]
["804563102","RM450","144141127005","8100"]
["804596875","RM450","144141128009","8100"]
["804623796","RM450","144141128012","8100","08-141128-02","8003"]
["804623795","RM450","144141128015","8100","08-141128-03","8003"]
["804623427","RM450","144141128018","8100","08-141128-04","1431"]
["804623089","RM450","144141203011","8100"]
["804596835","RM450","144141206007","8100","08-141206-02","3430"]
["804596898","RM450","144141207006","8100"]
["804602916","RM450","144141208004","8100"]
["804596837","RM450","144141209011","8100","08-141209-02","8003"]
["804623376","RM450","144141211007","8100"]
["804258850","RM450","144141212002","8100","08-141211-04","E311"]
["804602497","RM450","144141222004","8100","08-141222-00","8003"]
["804563119","RM450","144141230003","8100"]
["804623906","RM450","144150114002","8100","08-150114-00","3430"]
["804249718","RM450","144150120014","8100"]
["804623208","RM450","144150122002","8100","08-150122-00","R102"]
["804596967","RM450","144150123005","8100","08-150123-00","8003"]
["804623945","RM450","144150128013","8100","08-150128-02","3430"]
["804623338","RM450","144150128015","8100","08-150128-03","3430"]
["803897410","RM450","144150203002","8100","08-150203-00","3430"]
["804623294","RM450","144150203005","8100","08-150203-00","R397"]
["804916886","RM450","144150222003","8100","08-150222-00","8003"]
["804916886","RM450","144150222003","8100","08-150222-00","3430"]
["804596303","RM450","144150222004","8100"]
["804623619","RM450","144150222005","8100","08-150222-00","3430"]
["804249721","RM450","144150225017","8100","08-150225-03","3430"]
["804623772","RM450","144150226007","8100","08-150226-02","3430"]
["804917001","RM450","144150227013","8100"]
["804623621","RM450","144150228007","8100","08-150228-01","3430"]
["804623240","RM450","144150301004","8100","08-150301-00","3430"]
["804917113","RM450","144150301004","8100","08-150301-00","3430"]
["804917197","RM450","144150303009","8100","08-150303-03","8003"]
["804916608","RM450","144150307005","8100","08-150307-01","3430"]
["804917402","RM450","144150307006","8100","08-150307-02","3430"]
["804916540","RM450","144150320005","8100","08-150320-00","E311"]
["804917378","RM450","144150320012","8100"]
["804917498","RM450","144150321001","8100","08-150321-00","R102"]
["804917436","RM450","144150321004","8100","08-150321-00","A200"]
["804811836","RM450","144150327001","8100"]
["804811785","RM450","144150327003","8100","08-150327-00","3430"]
["804916744","RM450","144150327006","8100","08-150327-01","3430"]
["804567091","RM450","144150327018","8100"]
["804917375","RM450","144150329001","8100"]
["804917167","RM450","144150330016","8100"]
["804817146","RM450","144150330016","8100"]
["804916820","RM450","144150401007","8100","08-150401-05","R400"]
["804917087","RM450","144150402001","8100","08-150402-00","8003"]
["804817150","RM450","144150407003","8100","08-150407-00","R397"]
["804166292","RM450","144150407011","8100","08-150407-03","2130"]
["804822703","RM450","144150411009","8100","08-150411-04","E311"]
["804916699","RM450","144150412004","8100"]
["804822983","RM450","144150412005","8100"]
["804811726","RM450","144150413016","8100","08-150413-05","R397"]
["804812214","RM450","144150414010","8100"]
["804249725","RM450","144150415002","8100","08-150415-00","R102"]
["804812225","RM450","144150416004","8100"]
["804811932","RM450","144150417013","8100","08-150417-07","8003"]
["804823232","RM450","144150417014","8100"]
["804823304","RM450","144150418003","8100","08-150418-02","8003"]
["804811936","RM450","144150419009","8100","08-150419-04","8003"]
["804811935","RM450","144150419010","8100"]
["804811942","RM450","144150429007","8100"]
["804822642","RM450","144150504003","8100"]
["804811874","RM450","144150507016","8100"]
["804811627","RM450","144150515002","8100","08-150515-00","E311"]
["804811628","RM450","144150516001","8100","08-150515-10","1431"]
["804811685","RM450","144150516002","8100","08-150516-00","3430"]
["804822740","RM450","144150518013","8100","08-150518-09","R102"]
["804823292","RM450","144150521001","8100","08-150521-00","R397"]
["804812054","RM450","144150521002","8100","08-150521-00","3430"]
["804823082","RM450","144150521015","8100","08-150521-08","2130"]
["804812354","RM450","144150529003","8100","08-150529-00","3430"]
["804811689","RM450","144150605007","8100","08-150605-01","8003"]
["804811688","RM450","144150605007","8100","08-150605-01","8003"]
["804811687","RM450","144150605007","8100","08-150605-01","8003"]
["804823268","RM450","144150605022","8100","08-150605-08","A100"]
["804812050","RM450","144150606004","8100","08-150606-01","R115"]
["804823108","RM450","144150609002","8100"]
["804811691","RM450","144150609007","8100"]
["804811690","RM450","144150609007","8100"]
["804823491","RM450","144150612002","8100","08-150611-09","8003"]
["804812161","RM450","144150616005","8100"]
["804812164","RM450","144150616011","8100"]
["804811694","RM450","144150621001","8100","08-150620-12","1431"]
["805003703","RM450","144150623002","8100","08-150623-00","R400"]
["804811522","RM450","144150627011","8100","08-150627-10","E311"]
["804823422","RM450","144150717011","8100","08-150717-08","8003"]
["804823124","RM450","144150718004","8100","08-150718-01","8003"]
["804822591","RM450","144150718005","8100"]
["805003982","RM450","144150719001","8100"]
["804811539","RM450","144150719006","8100"]
["804822594","RM450","144150721001","8100"]
["804999099","RM450","144150725004","8100","08-150725-06","R400"]
["804986334","RM450","144150725008","8100"]
["805003954","RM450","144150728006","8100"]
["804636523","RM450","144150731001","8100","08-150731-00","1431"]
["805004487","RM450","144150731004","8100","08-150731-01","2170"]
["805004454","RM450","144150802008","8100","08-150802-06","R397"]
["804999228","RM450","144150803001","8100","08-150803-00","R115"]
["805004076","RM450","144150805004","8100","08-150805-02","R400"]
["805003986","RM450","144150805005","8100","08-150805-02","3430"]
["804823095","RM450","144150806005","8100","08-150806-03","8003"]
["805004180","RM450","144150807001","8100","08-150807-00","R397"]
["805004458","RM450","144150807005","8100","08-150807-03","E311"]
["805004026","RM450","144150807006","8100","08-150807-03","8003"]
["805003807","RM450","144150808004","8100","08-150808-01","E311"]
["805003956","RM450","144150813006","8100","08-150813-05","8003"]
["805003957","RM450","144150813008","8100"]
["804986322","RM450","144150817023","8100","08-150817-09","R201"]
["805004279","RM450","144150817024","8100","08-150817-10","R102"]
["805004366","RM450","144150823015","8100"]
["805004117","RM450","144150824002","8100","08-150824-02","D520"]
["804999218","RM450","144150827001","8100","08-150827-01","8003"]
["804821015","RM450","144150828011","8100"]
["804812325","RM450","144150830009","8100","08-150830-09","R102"]
["804812448","RM450","144150901004","8100","08-150901-04","R400"]
["805004263","RM450","144150901007","8100"]
["805004192","RM450","144150902014","8100","08-150902-06","8003"]
["805004194","RM450","144150902015","8100","08-150902-07","8003"]
["804821030","RM450","144150904001","8100","08-150904-00","8003"]
["805004232","RM450","144150911002","8100"]
["805003601","RM450","144150911003","8100","08-150911-01","8003"]
["805004149","RM450","144150919001","8100"]
["804998676","RM450","144150922001","8100"]
["805004165","RM450","144150924001","8100"]
["804999382","RM450","144150926002","8100","08-150926-00","R397"]
["804998857","RM450","144151001003","8100","08-151001-01","8003"]
["804999155","RM450","144151003006","8100"]
["805004271","RM450","144151006014","8100","08-151006-07","A210"]
["804916646","RM450","144151018011","8100","08-151018-04","1431"]
["805003924","RM450","144151020004","8100","08-151020-00","3430"]
["805414229","RM450","144151020010","8100"]
["805413826","RM450","144151021018","8100","08-151021-07","8003"]
["805412026","RM450","144151024002","8100"]
["805412027","RM450","144151024013","8100","08-151024-05","8003"]
["805437051","RM450","144151030004","8100","08-151030-00","A100"]
["805412051","RM450","144151030010","8100","08-151030-04","3430"]
["805411727","RM450","144151031004","8100","08-151031-04","8003"]
["805413627","RM450","144151101013","8100","08-151101-07","8003"]
["805414231","RM450","144151112006","8100","08-151112-04","A100"]
["805414232","RM450","144151112012","8100","08-151112-07","8003"]
["805414079","RM450","144151113002","8100"]
["805413834","RM450","144151113015","8100","08-151113-06","8003"]
["805412058","RM450","144151120003","8100"]
["805412090","RM450","144151126002","8100"]
["805413844","RM450","144151126005","8100"]
["805414312","RM450","144151211001","8100","08-151210-07","8003"]
["805411777","RM450","144151212011","8100"]
["805414309","RM450","144151216005","8100"]
["805411755","RM450","144151230012","8100","08-151230-07","A210"]
["805411877","RM450","144160101003","8100","08-160101-02","R102"]
["805412409","RM450","144160105012","8100","08-160105-04","8003"]
["805413955","RM450","144160109006","8100","08-160109-03","E311"]
["805412476","RM450","144160110004","8100"]
["805414320","RM450","144160111002","8100","08-160111-00","8003"]
["805571528","RM450","144160114013","8100","08-160114-03","R397"]
["805571580","RM450","144160202012","8100","08-160202-04","R397"]
["805411630","RM450","144160211001","8100","08-160210-07","3430"]
["805411583","RM450","144160217011","A224","08-160217-06","A100"]
["805572129","RM450","144160226018","8100"]
["805414006","RM450","144160301019","8100"]
["805411989","RM450","144160302002","8100","08-160302-00","3430"]
["805572136","RM450","144160302025","8100","08-160302-07","8003"]
["805571805","RM450","144160319005","8100","08-160319-02","3430"]
["805572038","RM450","144160319011","8100","08-160319-06","3430"]
["805411649","RM450","144160321012","8100","08-160321-06","3430"]
["805571675","RM450","144160322001","8100"]
["805412157","RM450","144160322001","8100"]
["805572277","RM450","144160326011","8100"]
["805571820","RM450","144160331015","8100","08-160331-07","R397"]
["805571917","RM450","144160403002","8100"]
["805265607","RM450","144160416011","8100","08-160416-04","3450"]
["805572322","RM450","144160417002","A224","08-160417-00","R397"]
["805572321","RM450","144160418007","8100"]
["805437114","RM450","144160420015","8100","08-160420-08","E311"]
["805571843","RM450","144160420015","8100","08-160420-08","E311"]
["805571847","RM450","144160501005","8100"]
["805266351","RM450","144160506001","8100","08-160506-00","3430"]
["805572412","RM450","144160507003","8100","08-160507-05","C511"]
["805572412","RM450","144160507003","8100","08-160507-05","8003"]
["805571738","RM450","144160515005","8100"]
["805265622","RM450","144160516015","8100","08-160516-05","3430"]
["805265975","RM450","144160614015","8100"]
["805526063","RM450","144160616003","8100"]
["805525728","RM450","144160618005","8100","08-160618-01","R102"]
["805389454","RM450","144160625002","8100"]
["805389077","RM450","144160628007","8100","08-160628-03","8003"]
["805389429","RM450","144160706006","8100"]
["805389128","RM450","144160710002","8100"]
["805266070","RM450","144160710003","8100"]
["805389440","RM450","144160711012","8100","08-160711-09","A100"]
["805266488","RM450","144160714004","8100"]
["805388890","RM450","144160728013","8100","08-160728-06","A210"]
["805389353","RM450","144160804012","8100","08-160804-09","R397"]
["805389354","RM450","144160805014","8100"]
["805389355","RM450","144160805015","8100"]
["805525641","RM450","144160903009","8100","08-160903-05","R397"]
["805526366","RM450","144160910007","8100"]
["805526456","RM450","144160924009","8100","08-160924-06","E311"]
["805526487","RM450","144161002006","8100","08-161002-02","R397"]
["805388726","RM450","144161002006","8100","08-161002-02","R397"]
["805389285","RM450","144161016010","8100","08-161016-05","2130"]
["805388704","RM450","144161022002","8100"]
["805525540","RM450","144161026004","8100","08-161026-03","E311"]
["805526163","RM450","144161030003","8100","08-161030-01","3430"]
["805525769","RM450","144161120018","8100","08-161120-05","3430"]
["805525796","RM450","144161127001","8100","08-161127-00","3430"]
["805202505","RM450","144161202002","8100"]
["805388781","RM450","144161204011","8100","08-161204-06","3430"]
["805525543","RM450","144161217002","8100","08-161217-00","3430"]
["805202679","RM450","144170119010","8100"]
["805203301","RM450","144170120002","8100"]
["805202876","RM450","144170121005","8100","08-170121-01","8003"]
["805202830","RM450","144170121011","8100","08-170121-06","R397"]
["805202511","RM450","144170125001","8100","08-170125-00","3430"]
["805202511","RM450","144170125001","8100","08-170125-00","8002"]
["805203302","RM450","144170204006","8100","08-170204-07","E311"]
["805322571","RM450","144170324019","8100"]
["805571972","RM450","144170420006","8100"]
["805203497","RM450","144170502004","8100","08-170502-01","8003"]
["805203460","RM450","144170512001","8100","08-170511-10","R115"]
["805202977","RM450","144170512001","8100","08-170511-10","R115"]
["805203471","RM450","144170827004","8100","08-170827-01","R102"]
["805711628","RM450","144170901005","8100","08-170901-05","R115"]
["805712062","RM450","144170902010","8100","08-170902-10","R115"]
["805689591","RM450","144170903003","8100"]
["805712339","RM450","144170909003","8100","08-170909-01","8003"]
["805593593","RM450","144170910001","8100","08-170910-01","R102"]
["805525722","RM450","144170916009","8100","08-170916-12","E311"]
["805414013","RM450","144170930013","8100","08-170930-08","8003"]
["805689909","RM450","144171001006","8100","08-171001-03","E311"]
["805490869","RM450","144171002010","8100"]
["805389350","RM450","144171019095","8100","08-171019-09","R400"]
["805712289","RM450","144171101016","8100","08-171101-11","R400"]
["805712400","RM450","144171109001","8100","08-171109-00","R397"]
["805712305","RM450","144171111004","8100","08-171111-08","E320"]
["805712305","RM450","144171111004","8100","08-171111-08","3430"]
["805712306","RM450","144171111004","8100","08-171111-08","E320"]
["805712306","RM450","144171111004","8100","08-171111-08","3430"]
["805712307","RM450","144171111004","8100","08-171111-08","E320"]
["805712307","RM450","144171111004","8100","08-171111-08","3430"]
["805265782","RM450","144171126002","8100"]
["805712299","RM450","144171204001","8100","08-171204-01","8003"]
["805203133","RM450","144171212008","8100","08-171212-12","3430"]
["805203133","RM450","144171212008","8100","08-171212-13","D520"]
["805690041","RM450","144171216003","8100","08-171216-01","3430"]
["805902151","RM450","144171223001","8100"]
["805203134","RM450","144171224002","8100","08-171224-00","R397"]
["802208861","RM450","144070206002A","8100"]
["802277299","RM450","144080411003A","8100"]
["802209091","RM450","144080417004B","8100"]
["802664729","RM450","144080609024A","8100"]
["802664509","RM450","144081023012A","8100"]
["802930613","RM450","144090218013A","8100"]
["803147812","RM450","144090529010A","8100"]
["803031833","RM450","144090802001A","8100"]
["803074478","RM450","144090807002A","8100"]
["803031460","RM450","144090901012A","8100"]
["803102926","RM450","144091030003A","8100"]
["803074554","RM450","144091113003A","8100"]
["803031937","RM450","144091202003A","8100"]
["803031655","RM450","144091212001A","8100"]
["803074903","RM450","144091212001A","8100"]
["803353303","RM450","144100416009A","8100"]
["803353115","RM450","144100501007A","8100"]
["803353091","RM450","144100529010A","8100"]
["803353321","RM450","144100602003A","8100"]
["803353191","RM450","144100602019A","8100"]
["803353939","RM450","144100621012A","8100"]
["803353940","RM450","144100621012A","8100"]
["803353891","RM450","144100807006A","8100"]
["803250559","RM450","144100904002A","8100"]
["803250482","RM450","144100908035A","8100"]
["802958792","RM450","144100921018B","8100"]
["803353682","RM450","144100922002B","8100"]
["803353821","RM450","144100928004A","8100"]
["803250707","RM450","144100928007A","8100"]
["803250284","RM450","144101130004A","8100"]
["803258354","RM450","144101212006A","8100"]
["803258099","RM450","144101227011A","8100"]
["803258325","RM450","144101231002A","8100"]
["803258640","RM450","144110206012A","8100"]
["803258574","RM450","144110219010A","8100"]
["803646752","RM450","144110304002A","8100"]
["803258844","RM450","144110312004A","8100"]
["803646820","RM450","144110315015A","8100"]
["803646147","RM450","144110331001A","8100"]
["803258600","RM450","144110407002A","8100"]
["803452855","RM450","144110408005A","8100"]
["803258400","RM450","144110414008B","8100"]
["803646393","RM450","144110418006A","8100"]
["803646665","RM450","144110428020A","8100"]
["803646993","RM450","144110430003A","8100"]
["803646933","RM450","144110430019A","8100"]
["803452962","RM450","144110506002B","8100"]
["803452921","RM450","144110520004A","8100"]
["803452921","RM450","144110520006A","8100"]
["803714039","RM450","144110625011A","8100"]
["803477927","RM450","144110701006A","8100"]
["803477271","RM450","144110702005A","8100"]
["803717893","RM450","144110728016A","8100"]
["803477702","RM450","144110809012B","8100"]
["803524708","RM450","144110924001A","8100"]
["803477723","RM450","144110925003A","8100"]
["803504785","RM450","144111006020A","8100"]
["803524942","RM450","144111021010A","8100"]
["803522280","RM450","144111026010A","8100"]
["803504605","RM450","144111101012A","8100"]
["803504767","RM450","144111117019A","8100"]
["803524126","RM450","144111201021A","8100"]
["803524077","RM450","144111202013A","8100"]
["803524890","RM450","144111206018A","8100"]
["803524487","RM450","144120106009A","8100"]
["803524261","RM450","144120120015A","8100"]
["803524109","RM450","144120122011A","8100"]
["803524337","RM450","144120208003A","8100"]
["803753077","RM450","144120229012A","8100"]
["803753314","RM450","144120314009A","8100"]
["803753669","RM450","144120321015B","8100"]
["803504321","RM450","144120324010A","8100"]
["803753802","RM450","144120328002A","8100"]
["803524055","RM450","144120406010A","8100"]
["803577115","RM450","144120407007A","8100"]
["803863102","RM450","144120504015A","8100"]
["803774074","RM450","144120525001A","8100"]
["803865503","RM450","144120628008A","8100"]
["803865289","RM450","144120704023A","8100"]
["803865445","RM450","144120709016A","8100"]
["803753174","RM450","144120812001B","8100"]
["803888399","RM450","144120816013A","8100"]
["803888893","RM450","144120823014A","8100"]
["803897397","RM450","144120910001A","8100"]
["803913678","RM450","144120921008A","8100"]
["803913679","RM450","144120921008A","8100"]
["803913075","RM450","144120921016A","8100"]
["803913837","RM450","144121023006A","8100"]
["803913844","RM450","144121116004A","8100"]
["803913477","RM450","144121228001A","8100"]
["803913642","RM450","144130104001A","8100"]
["803859336","RM450","144130302002A","8100"]
["803859639","RM450","144130315006B","8100"]
["803859464","RM450","144130323004B","8100"]
["803605312","RM450","144130329013A","8100"]
["803859923","RM450","144130407007B","8100"]
["804166886","RM450","144130424001A","8100"]
["804185261","RM450","144130512001A","8100"]
["804258371","RM450","144130518009A","8100"]
["804194299","RM450","144130529011B","8100"]
["804185232","RM450","144130529011B","8100"]
["804185992","RM450","144130611003A","8100"]
["804185751","RM450","144130627016A","8100"]
["804194831","RM450","144130629012A","8100"]
["804194478","RM450","144130708003A","8100"]
["804166202","RM450","144130715001A","8100"]
["804166343","RM450","144130723010A","8100"]
["804166258","RM450","144130725003A","8100"]
["804258952","RM450","144130804011A","8100"]
["804258957","RM450","144130908006A","8100"]
["804240046","RM450","144130921005A","8100"]
["804185943","RM450","144130924002A","8100"]
["804240022","RM450","144131025001A","8100"]
["804258613","RM450","144131026010B","8100"]
["804258617","RM450","144131110007B","8100"]
["804249300","RM450","144131212001A","8100"]
["804240889","RM450","144131217009A","8100"]
["804249402","RM450","144131227015A","8100"]
["804194893","RM450","144140113006A","8100"]
["804335247","RM450","144140310011A","8100"]
["804335822","RM450","144140314014A","8100"]
["804166650","RM450","144140326019B","8100"]
["804339756","RM450","144140405004A","8100"]
["804240246","RM450","144140420001A","8100"]
["804339519","RM450","144140425016A","8100"]
["804339723","RM450","144140502011A","8100"]
["804563280","RM450","144140513014A","8100"]
["804563210","RM450","144140519003A","8100"]
["804563151","RM450","144140526001A","8100"]
["804335567","RM450","144140612013A","8100"]
["803897783","RM450","144140624007A","8100"]
["804567704","RM450","144140627012A","8100"]
["804567020","RM450","144140728008A","8100"]
["804563635","RM450","144140815015A","8100"]
["804569811","RM450","144140826008A","8100"]
["804602165","RM450","144140917005A","8100"]
["804563661","RM450","144141007001A","8100"]
["804623088","RM450","144141203010A","8100"]
["804596822","RM450","144150106001A","8100"]
["804811801","RM450","144150318016A","8100"]
["804916997","RM450","144150319003A","8100"]
["804917366","RM450","144150320013A","8100"]
["804822929","RM450","144150413008A","8100"]
["804811551","RM450","144150523002A","8100"]
["804623197","RM450","144150528004A","8100"]
["804812308","RM450","144150609001A","8100"]
["804998808","RM450","144150613005A","8100"]
["804812088","RM450","144150701001A","8100"]
["805003981","RM450","144150718003A","8100"]
["804986442","RM450","144150731003A","8100"]
["804569873","RM450","144150815001A","8100"]
["805004370","RM450","144150828002A","8100"]
["805004295","RM450","144150929005A","8100"]
["805004296","RM450","144150929005A","8100"]
["804999491","RM450","144151008001B","8100"]
["804812422","RM450","144151009008A","8100"]
["805412254","RM450","144151122005B","8100"]
["805414244","RM450","144151219013A","8100"]
["805437098","RM450","144151219013A","8100"]
["805411879","RM450","144160105002A","8100"]
["805411784","RM450","144160105002A","8100"]
["805572133","RM450","144160302026A","8100"]
["805412107","RM450","144160312008A","8100"]
["805525737","RM450","144160701008A","8100"]
["805525903","RM450","144160729010A","8100"]
["805388858","RM450","144160806006A","8100"]
["805525587","RM450","144160906001A","8100"]
["805526466","RM450","144161021003A","8100"]
["805202854","RM450","144161115001A","8100"]
["805689613","RM450","144170617002A","8100"]
["805202943","RM450","144170629031A","8100"]
["805712126","RM450","144170815018A","8100"]
["805689813","RM450","144170902002A","8100"]
["805689814","RM450","144170902002A","8100"]
["805690166","RM450","144171103006A","8100"]
["803102920","RM450","144100209011","8100","801002090050","R102"]
["803452677","RM450","144110416002","8100"]
["803477423","RM450","144110531017","8100"]
["803452823","RM450","144110626002","8100","801106260011","3300"]
["803524347","RM450","144120323013","8100","801203220064","E320"]
["803524347","RM450","144120323013","8100","801203230041","3300"]
["803888894","RM450","144120824012","8100","801208240090","R115"]
["803395876","RM450","144120912006","8100","801209120035","2130"]
["803873968","RM450","144121004002","8100"]
["803865898","RM450","144121030001","8100","801210300009","R400"]
["803913504","RM450","144121113003","8100"]
["803897157","RM460","144121130003","8100"]
["803888412","RM450","144121223003","8100","801212230010","2120"]
["803913398","RM450","144130208003","8100","801302080008","R102"]
["803859902","RM450","144130211012","8100","801302110041","8003"]
["803859844","RM450","144130303002","8100"]
["804194151","RM450","144130318008","8100"]
["803913623","RM450","144130329007","8100","801303290022","8003"]
["803904069","RM450","144130330003","8100","801303300008","R400"]
["804185606","RM450","144130410004","8100"]
["803904294","RM450","144130412014","8100","801304120055","1640"]
["803873340","RM450","144130423003","8100","801304230005","R102"]
["804194163","RM450","144130423011","8100","801304230065","8003"]
["804185398","RM450","144130501001","8100"]
["804166487","RM450","144130502002","8100"]
["804166789","RM450","144130518002","8100","801305180006","2170"]
["804194656","RM450","144130526003","8100"]
["804185957","RM450","144130527001","8100","801305260081","8003"]
["804194855","RM450","144130610010","8100","801306100039","R102"]
["804194436","RM460","144130620004","8100","801306200011","R102"]
["804166818","RM450","144130625002","8100"]
["804185065","RM450","144130628001","8100"]
["803865824","RM450","144130704008","8100","801307040046","2130"]
["804194587","RM450","144130712009","8100","801307120049","E311"]
["804194868","RM450","144130802017","8100"]
["804194748","RM450","144130805015","8100","801308050057","8003"]
["804166554","RM450","144130812010","8100"]
["804258203","RM450","144130815002","8100"]
["804258376","RM450","144130823008","8100","801308230023","8003"]
["804194773","RM450","144130823028","8100","801308230087","R102"]
["804240513","RM450","144130826004","8100"]
["804258994","RM450","144130831003","8100"]
["804185563","RM450","144130913002","8100"]
["804194329","RM450","144130914002","8100"]
["804166415","RM450","144130918005","8100"]
["804258148","RM450","144130920018","8100"]
["804258149","RM450","144130920019","8100"]
["804166599","RM450","144130920021","8100","801309200099","A100"]
["804258150","RM450","144130920022","8100"]
["804240048","RM450","144130922003","8100","801309220037","8003"]
["804249626","RM450","144130927012","8100","801309270088","8003"]
["804258510","RM450","144131013002","8100"]
["804249095","RM450","144131013016","8100","801310130075","E311"]
["804258243","RM450","144131013018","8100","801310130091","3300"]
["804240024","RM450","144131027001","8100"]
["804258296","RM450","144131028004","8100","801310280023","2130"]
["804258295","RM450","144131028008","8100"]
["804258036","RM450","144131028015","8100"]
["804258297","RM450","144131029006","8100","801310290024","2130"]
["804194348","RM450","144131102012","8100","801311020075","R400"]
["804240211","RM450","144131124001","8100"]
["804166966","RM450","144131125016","8100","801311250070","8003"]
["804240929","RM450","144131127002","8100"]
["804240459","RM450","144131207005","8100"]
["804249877","RM450","144131219024","8100"]
["804240469","RM450","144131222008","8100","801312220055","R102"]
["804240101","RM450","144131227001","8100"]
["804240175","RM450","144140117001","8100"]
["804249849","RM450","144140203012","8100"]
["804240251","RM450","144140220017","8100","801402200064","R400"]
["804335405","RM450","144140225020","8100","801402250041","8003"]
["804335356","RM450","144140226004","8100","801402260021","8003"]
["804240128","RM450","144140228014","8100"]
["804240718","RM450","144140314009","8100"]
["804335272","RM450","144140320001","8100","801403200003","3430"]
["804339893","RM450","144140321003","8100"]
["804240724","RM450","144140322002","8100"]
["804240144","RM450","144140322007","8100","801403220019","E311"]
["804240267","RM450","144140330009","8100","801403300057","R102"]
["804339562","RM450","144140403015","8100","801404030075","R400"]
["804339744","RM450","144140415002","8100"]
["804339989","RM450","144140415003","8100","801404150006","R102"]
["804339415","RM450","144140425003","8100","801404250004","8003"]
["804335482","RM450","144140425004","8100","801404250012","R116"]
["804335662","RM450","144140425005","8100","801404250005","1431"]
["804339621","RM450","144140521004","8100"]
["804335161","RM450","144140522002","8100","801405220009","2130"]
["804335015","RM450","144140531009","8100","801405310103","E311"]
["804563470","RM450","144140602012","8100","801406020042","8003"]
["804563043","RM450","144140608004","8100"]
["804335621","RM450","144140609009","8100","801406090037","2130"]
["804567219","RM450","144140609014","8100","801406090075","3430"]
["803873709","RM450","144140612003","8100"]
["804567179","RM450","144140629003","8100"]
["804567887","RM450","144140712013","8100"]
["804563690","RM450","144140724010","8100","801407240059","3450"]
["804567017","RM450","144140727004","8100","801407270032","8003"]
["804567767","RM450","144140728007","8100","801407280026","2130"]
["804567198","RM450","144140801001","8100"]
["804567556","RM450","144140808016","8100"]
["804567625","RM450","144140815017","8100"]
["804596032","RM450","144140815018","8100","801408150062","E311"]
["804602206","RM450","144140819006","8100","801408180044","2130"]
["804596047","RM450","144140903001","8100"]
["804602217","RM450","144140910005","8100"]
["804596347","RM450","144140926007","8100","801409260029","2130"]
["804602797","RM450","144141002002","8100","801410020029","E311"]
["804567396","RM450","144141005006","8100"]
["804602300","RM450","144141020008","8100","801410200044","8003"]
["804596543","RM450","144141026007","8100","08-141026-00","E311"]
["804596885","RM450","144141115005","8100"]
["804596935","RM450","144141125011","8100"]
["804563779","RM450","144141126002","8100"]
["804602567","RM450","144141130014","8100","08-141130-04","3430"]
["804563111","RM450","144141204010","8100"]
["804623201","RM450","144141205002","8100"]
["804258849","RM450","144141209008","21405","08-141209-01","2130"]
["804596425","RM450","144141225002","8100","08-141225-00","3430"]
["804602809","RM450","144150109001","8100","08-150109-00","8003"]
["804563787","RM450","144150109017","8100","08-150109-05","R116"]
["804623526","RM450","144150124003","8100","08-150124-00","3430"]
["804596848","RM450","144150125003","8100"]
["804623370","RM450","144150126001","8100","08-150126-00","3430"]
["804623264","RM450","144150129001","8100"]
["804623808","RM450","144150131002","8100","08-150131-00","3430"]
["804623266","RM450","144150207009","8100"]
["804917259","RM450","144150224013","8100","08-150224-04","2130"]
["804623239","RM450","144150228005","8100","08-150228-00","R397"]
["804917267","RM450","144150311001","8100","08-150311-00","2170"]
["804623969","RM450","144150318006","8100","08-150318-00","8003"]
["804917386","RM450","144150330015","8100"]
["804623068","RM450","144150403002","8100"]
["804822752","RM450","144150408001","8100","08-150408-00","8003"]
["804917459","RM450","144150412001","8100","08-150412-00","R400"]
["804917214","RM450","144150420001","8100","08-150419-07","E311"]
["804811911","RM450","144150426001","8100","08-150426-00","8003"]
["804822728","RM450","144150429001","8100"]
["804822658","RM450","144150516003","8100"]
["804812053","RM450","144150516006","8100","08-150516-01","8003"]
["804917419","RM450","144150516008","8100","08-150516-03","E311"]
["804811509","RM450","144150612004","8100"]
["804636501","RM450","144150622004","8100"]
["804822571","RM450","144150629001","8100","08-150628-08","8003"]
["805004101","RM450","144150724005","8100"]
["804811698","RM450","144150725009","8100"]
["804636520","RM450","144150726003","8100"]
["804811700","RM460","144150727001","8100","08-150727-00","R397"]
["805004452","RM450","144150801013","8100","08-150801-06","8003"]
["804812442","RM450","144150808001","8100","08-150808-00","8003"]
["804986321","RM450","144150814012","8100"]
["804999214","RM450","144150822011","8100"]
["805003789","RM450","144150823006","8100"]
["805003681","RM450","144150907001","8100","08-150907-00","8003"]
["805003787","RM450","144150916010","8100","08-150916-07","8003"]
["805004163","RM450","144150922002","8100"]
["804916628","RM450","144150922024","8100","08-150922-07","R397"]
["804998853","RM450","144150925015","8100","08-150925-07","R115"]
["804998853","RM450","144150925015","8100","08-150925-07","R201"]
["804812062","RM450","144151001011","8100","08-151001-09","8003"]
["804998883","RM450","144151004001","8100","08-151004-01","A100"]
["804999489","RM450","144151005001","8100","08-151005-00","R102"]
["805004339","RM450","144151006002","8100"]
["804998708","RM450","144151009016","8100","08-151009-04","R397"]
["805004336","RM450","144151010012","8100"]
["805414228","RM450","144151020009","8100","08-151020-04","2130"]
["804998580","RM450","144151021012","8100","08-151021-03","R102"]
["805413927","RM450","144151021013","8100","08-151021-04","R102"]
["805412028","RM450","144151024014","8100"]
["805466853","RM450","144151102012","8100","08-151102-06","2130"]
["805412227","RM450","144151108003","8100","08-151108-00","C512"]
["805412227","RM450","144151108003","8100","08-151108-00","A100"]
["805414053","RM450","144151116001","8100","08-151116-00","8003"]
["805466888","RM450","144151204010","8100","08-151204-08","R102"]
["805466888","RM450","144151204010","8100","08-151204-06","8003"]
["805466888","RM450","144151204010","8100","08-151204-07","E320"]
["805414248","RM450","144160101004","8100","08-160101-07","R102"]
["805413922","RM450","144160102001","8100","08-160102-00","R400"]
["805571529","RM450","144160115013","8100","08-160115-07","9200"]
["805411831","RM450","144160116001","8100"]
["805503531","RM450","144160227001","8100"]
["805571726","RM450","144160305005","8100"]
["805430670","RM450","144160305007","8100"]
["805571768","RM450","144160403004","8100"]
["805412167","RM450","144160408001","8100"]
["805265629","RM450","144160415002","8100"]
["805572091","RM450","144160419001","8100","08-160418-07","3430"]
["805412274","RM450","144160527007","8100","08-160527-08","R102"]
["805389154","RM450","144160708001","8100","08-160707-10","3430"]
["805525749","RM450","144160714002","8100","08-160714-00","3430"]
["805265948","RM450","144160714011","8100","08-160714-07","E311"]
["805265779","RM450","144160718001","8100","08-160718-00","8003"]
["805389092","RM450","144160726019","8100","08-160726-04","E311"]
["805389390","RM450","144160804001","8100","08-160804-00","A210"]
["805525878","RM450","144160812005","8100","08-160812-01","E311"]
["805389167","RM450","144160831003","8100"]
["805414010","RM450","144160902002","8100"]
["805525607","RM450","144160916007","8100","08-160916-00","R397"]
["805525865","RM450","144161002005","8100","08-161002-01","8003"]
["805526213","RM450","144161030004","8100","08-161030-02","8003"]
["805525541","RM450","144161101015","8100","08-161101-08","3430"]
["805202753","RM450","144161123002","8100"]
["805388513","RM450","144161222001","8100"]
["805388514","RM450","144161226002","8100","08-161226-00","R397"]
["805526141","RM450","144170218009","8100","08-170218-04","E311"]
["805524215","RM450","144170221018","8100"]
["805388588","RM450","144170223006","8100","08-170223-02","8003"]
["805202904","RM450","144170505010","8100"]
["805266093","RM450","144170512015","8100","08-170512-05","1431"]
["805414149","RM450","144170604001","8100","08-170604-01","E200"]
["805265995","RM450","144170702003","8100"]
["805690403","RM450","144170709001","8100"]
["805256971","RM450","144170709008","8100"]
["805692330","RM450","144170713002","8100","08-170713-00","3430"]
["805689621","RM450","144170722003","8100"]
["805690480","RM450","144170802012","8100"]
["805712058","RM450","144170824003","8100"]
["805339548","RM450","144170826002","8100","08-170826-01","R397"]
["805711582","RM450","144170901003","8100","08-170901-00","3430"]
["805490862","RM450","144170912014","8100","08-170912-10","1421"]
["805203474","RM450","144170920048","8100","08-170920-11","8003"]
["805712176","RM450","144170930012","8100","08-170930-09","A100"]
["805414016","RM450","144171001008","8100","08-171001-06","R397"]
["805414015","RM450","144171001011","8100"]
["805711928","RM450","144171004001","8100","08-171003-12","E311"]
["805414346","RM450","144171102009","8100","08-171102-07","E311"]
["805712507","RM450","144171104012","8100","08-171104-10","R115"]
["805711937","RM450","144171115002","8100","08-171115-00","2170"]
["802336548","RM450","144070923002A","8100"]
["802636092","RM450","144080301004A","8100"]
["802636186","RM450","144080328002A","8100"]
["802664766","RM450","144080701017C","8100"]
["802209159","RM450","144080912002A","8100"]
["803147213","RM450","144090306002A","8100"]
["803147773","RM450","144090730001A","8100"]
["803031454","RM450","144090807004A","8100"]
["803074534","RM450","144090904013A","8100"]
["803102507","RM460","144090922022A","8100"]
["803309090","RM450","144090927016A","8100"]
["803031920","RM450","144091018002A","8100"]
["803309437","RM450","144091030013A","8100"]
["803309212","RM450","144100304012A","8100"]
["803090638","RM450","144100409002A","8100"]
["803353242","RM450","144100418003A","8100"]
["803353479","RM450","144100424004A","8100"]
["803102439","RM450","144100512015B","8100"]
["803250001","RM450","144100528012A","8100"]
["803646669","RM450","144110523010A","8100"]
["803477518","RM450","144110531016A","8100"]
["803714070","RM450","144110713017A","8100"]
["803258911","RM450","144110729004A","8100"]
["803477716","RM450","144110909002A","8100"]
["803452323","RM450","144110922009A","8100"]
["803524915","RM450","144111022007A","8100"]
["803522739","RM450","144111024003A","8100"]
["803522491","RM450","144111105001B","8100"]
["803524024","RM450","144111221005A","8100"]
["803753465","RM450","144120204002A","8100"]
["803897637","RM450","144120805001A","8100"]
["803897959","RM450","144120811002A","8100"]
["803913645","RM450","144130112014A","8100"]
["803888473","RM450","144130128002A","8100"]
["803904286","RM450","144130216001A","8100"]
["803605487","RM450","144130331001B","8100"]
["803859295","RM450","144130408013B","8100"]
["804194788","RM450","144130410002A","8100"]
["804185845","RM450","144130411003A","8100"]
["804194397","RM450","144130624003B","8100"]
["804185192","RM450","144130628002A","8100"]
["804258498","RM450","144130728003A","8100"]
["804194456","RM450","144130828011A","8100"]
["804249630","RM450","144131007020A","8100"]
["804249632","RM450","144131007021A","8100"]
["804249583","RM450","144131016001A","8100"]
["804249281","RM450","144131102003A","8100"]
["804249322","RM450","144140222002B","8100"]
["804563238","RM450","144140524004A","8100"]
["804567203","RM450","144140525008A","8100"]
["804335564","RM450","144140601003A","8100"]
["804335024","RM450","144140619010A","8100"]
["804563634","RM450","144140807007A","8100"]
["804602577","RM450","144140905001A","8100"]
["804602705","RM450","144141005007A","8100"]
["804823388","RM450","144150514001A","8100"]
["804823463","RM450","144150618012A","8100"]
["804986312","RM450","144150727002A","8100"]
["805413853","RM450","144151108004A","8100"]
["805411778","RM450","144151213003A","8100"]
["805411904","RM450","144151213004A","8100"]
["805412072","RM450","144151228004A","8100"]
["805411637","RM450","144160226015A","8100"]
["805389401","RM450","144160601008A","8100"]
["805525955","RM450","144160603011A","8100"]
["805389085","RM450","144160725018A","8100"]
["805389317","RM450","144160904001A","8100"]
["805526383","RM450","144160911002A","8100"]
["805389325","RM450","144160922007A","8100"]
["805202508","RM450","144161225002A","8100"]
["805689586","RM450","144170818018A","8100"]
["805414198","RM450","144171103002A","8100"]